{"text_format":"1","workbook":"xlsx","n_sheets":5,"sheets":["Instructions","Index","Price List","Websites","Updates"],"not_rendered":{"charts":0,"images":1,"macros":1,"external_links":0,"defined_names":20,"comments":0,"pivot_tables":0},"unopened":[],"bounds":{"document_bytes":16777216,"sheet_cells":100000,"rows_first":2000,"rows_last":500,"rows_between":2000,"halvings":0,"cell_chars":16384,"cell_head_chars":4096},"cells_cut":0,"cells_raw":0,"read":"whole","date_system":"1900"}

{"sheet":"Instructions","index":0,"n_rows":63,"n_cols":10,"rows_kept":63,"cut":false,"hidden":false,"merged":[[7,2,7,6]]}
["Manufacturer","Tools"]
["File as","T"]
["Product Code","N"]
["CCTD Effective Date","4/1/26"]
[]
[]
[]
["Enter your Company Name"]
[]
[null,"Click on \"Index\" to set the print area for the price list index"]
[null,"Then you can send it to print"]
[]
[]
[null,"Click on \"Suggested Price List\" to set the print area for Conestoga Tile's suggested price list."]
[null,"Then you can send it to print"]
[]
[]
[null,"Enter your discount codes if you want a personal net cost sheet."]
[]
[null,null,"Product"]
[null,null,"Code","Disc. %"]
[null,null,{"$f":"+B3","v":"N"},0,"  This is a \"NET\" price list.  0% is the discount for this spreadsheet"]
[]
[null,"Click on \"Your Cost\" to set the print area for your personal cost report."]
[null,"Then you can send it to print"]
[]
[]
["Discount: ","To help establish your price list, enter the gross profit percent for each type of product."]
[null,"If you want to use Conestoga Tile's list price, leave them blank."]
[]
["Round Nickel: ","If you always want your price to round to the nearest nickel, enter \"YES\"."]
[null,"If you enter \"NO\", it will NOT round to the nearest nickel."]
[]
["Ending Cents: ","If you always want your price to end with a certain cents, enter that cent value."]
[null,"If you leave it \"blank\" will NOT round to this cent value."]
[]
[null,"GP Margin % for","Group","GP Margin","Round Nickel","add/subtract","Ending Cents"]
[null,"Gundlach - All","GU",null,"No",0]
[null,"Hydra - All","HY",null,"No",0]
[null,"IQ Tools - Saws/Cutters","IQ1",null,"No",0,null,null,null," "]
{"$rows_left_out":24}
{"sheet":"Index","index":1,"n_rows":50,"n_cols":9,"rows_kept":50,"cut":false,"hidden":false,"merged":[[5,0,5,10],[47,0,47,10],[49,0,49,10],[2,5,2,10],[3,4,3,7],[10,2,10,4],[10,8,10,10]]}
[]
[]
[null,null,null,null,null,{"$f":"\"File '\"&Instructions!B2&\"' - \"&Instructions!B1","v":"File 'T' - Tools"}]
[]
[]
[{"$f":"\"Price List Index - \"&Instructions!B4","v":"Price List Index - 4/1/26"}]
[]
[]
[]
[]
["Page",null,"Product Type",null,null,null,"Page",null,"Product Type"]
[]
[]
[]
[]
[]
[]
[]
[]
[]
[]
[]
[]
[]
[]
[]
[]
[]
[]
[]
[]
[]
[]
[]
[]
[]
[]
[]
[]
[]
{"$rows_left_out":11}
{"sheet":"Price List","index":2,"n_rows":521,"n_cols":43,"rows_kept":521,"cut":false,"hidden":false,"merged":[[3,24,3,25],[4,24,4,25],[3,16,3,21],[4,32,4,34],[510,5,510,6],[507,4,507,21],[8,4,8,6],[505,4,505,20],[10,4,10,20],[9,4,9,20],[8,16,8,17],[423,4,423,20],[202,20,203,20]]}
[null,null,null,{"$error":"#N/A"},null,"Our Part #",null,"Description",null,null,null,null,null,null,null,null,"Mfg.",null,null,null,{"$f":"IF(Suggested=\"Yes\",'Price List'!AC1,'Price List'!AI1)","v":{"$error":"#N/A"}},"EA",{"$f":"+Instructions!$B$3","v":"N"},null,{"$f":"+Instructions!$D$22","v":0},{"$f":"ROUND($AC1*(1-Y1)+0.004999,2)","v":{"$error":"#N/A"}},null,"new",{"$error":"#N/A"},{"$f":"+Y1","v":0},{"$f":"+Z1","v":{"$error":"#N/A"}},{"$f":"(AI1-AE1)/AI1","v":{"$error":"#N/A"}},null,{"$f":"+C1","v":0},{"$f":"SUM(AL1:AN1)+AG1","v":{"$error":"#N/A"}},null,null,{"$f":"ROUND(AE1/(1-VLOOKUP(AH1,Group,2,FALSE)),2)","v":{"$error":"#N/A"}},{"$f":"IF(VLOOKUP(AH1,Group,3,FALSE)=\"YES\",VLOOKUP(ROUND(ROUND(AL1,1)-AL1,2),Round,2,FALSE)+VLOOKUP(AH1,Group,4,FALSE),0)","v":{"$error":"#N/A"}},{"$f":"IF(VLOOKUP(AH1,Group,5,FALSE)=\"\",0,ROUND(AL1-0.04999,1)-AL1+AO1)","v":{"$error":"#N/A"}},{"$f":"IF(VLOOKUP(AH1,Group,5,FALSE)=\"\",\"\",VLOOKUP(AH1,Group,5,FALSE))","v":{"$error":"#N/A"}},null,"X"]
[null,null,null,"Format",null,null,null,null,null,null,null,null,null,null,null,null,null,null,"Stock","a",1000,"ABC",null,null,0.1,1000,null,"ABC",1000,0.1,1000,0.1,10,null,1000,null,null,null,null,null,null,null,"X"]
[null,null,null,null,null,null,null,null,null,null,null,null,null,null,null,null,null,null,null,null,null,null,null,null,null,null,null,null,null,null,null,null,null,null,null,null,null,null,null,null,null,null,"X"]
[null,null,null,null,null,null,null,null,null,null,null,null,null,null,null,null,{"$f":"\"File '\"&Instructions!B2&\"' - \"&Instructions!B1","v":"File 'T' - Tools"},null,null,null,null,null,null,null,null,null,null,null,null,null,null,null,null,null,"Retail Price Calculations",null,null,null,null,null,null,null,"X"]
[null,null,null,null,null,null,null,null,null,null,null,null,null,null,null,null,null,null,null,null,null,{"$f":"+Instructions!B4","v":"4/1/26"},null,null,"Cost",null,null,null,null,null,null,null,{"$f":"TODAY()","v":"2026-03-06"},null,null,null,null,null,null,null,null,null,"X"]
[null,null,null,null,{"$f":"\"Product Code '\"&Instructions!B3&\"'\"","v":"Product Code 'N'"},null,null,null,null,null,null,null,null,null,null,null,null,null,null,null,null,null,null,null,null,null,null,null,null,null,null,null,null,null,null,null,null,null,null,null,null,null,"X"]
[null,null,null,null,null,null,null,null,null,null,null,null,null,null,null,null,null,null,null,null,null,null,null,null,null,null,null,null,null,null,null,null,null,null,null,null,null,null,null,null,null,null,"X"]
[null,null,null,null,null,null,null,null,null,null,null,null,null,null,null,null,null,null,null,null,null,null,null,null,null,null,null,null,null,null,null,null,null,null,null,null,null,null,null,null,null,null,"X"]
["Mfg Item #",null,null,null,"Part Number",null,null,"Description",null,null,null,null,null,null,null,null,"Manufacturer",null,"Stock","Note","Net Price","U/M","Code",null,"Disc.","Net",null,"Chg","Net Price","Disc","Act. Cost","GP%","Adj.","Group","Price",null,null,"Calc Price",".05 Round","Cents","Round to",null,"X"]
[null,null,null,null,"PRICING LISTED IS NET PRICING.  TRADE DISCOUNTS DO NOT APPLY.",null,null,null,null,null,null,null,null,null,null,null,null,null,null,null,null,null,null,null,null,null,null,null,null,null,null,null,null,null,null,null,null,null,null,null,null,null,"X"]
[null,null,null,null,"Pricing is subject to change without notice.",null,null,null,null,null,null,null,null,null,null,null,null,null,null,null,null,null,null,null,null,null,null,null,null,null,null,null,null,null,null,null,null,null,null,null,null,null,"X"]
[null,null,null,null,null,null,null,null,null,null,null,null,null,null,null,null,null,null,null,null,null,null,null,null,null,null,null,null,null,null,null,null,null,null,null,null,null,null,null,null,null,null,"X"]
[null,null,null,null,"Trowels",null,null,null,null,null,null,null,null,null,null,null,null,null,null,null,null,null,null,null,null,null,null,null,null,null,null,null,null,null,null,null,null,null,null,null,null,null,"X"]
[null,null,null,null,null,null,null,null,null,null,null,null,null,null,null,null,null,null,null,null,null,null,null,null,null,null,null,null,null,null,null,null,null,null,null,null,null,null,null,null,null,null,"X"]
[null,null,null,null,null,"U-Notched and Square-Notched Trowels",null,null,null,null,null,null,null,null,null,null,null,null,null,null,null,null,null,null,null,null,null,null,null,null,null,null,null,null,null,null,null,null,null,null,null,null,"X"]
["TR1414SQ",null,"RS","RTC - All Other",null,"RSTRTR1414SQ",null,"1/4 x 1/4",null,"TR1414SQ",null,"- Soft Grip, Stainless Steel, Sq-Notch",null,null,null,null,"RTC",null,"Stock","new",{"$f":"IF(Suggested=\"Yes\",'Price List'!AC16,'Price List'!AI16)","v":12.45},"EA",{"$f":"+Instructions!$B$3","v":"N"},null,{"$f":"+Instructions!$D$22","v":0},{"$f":"ROUND($AC16*(1-Y16)+0.004999,2)","v":12.45},null,"new",12.45,{"$f":"+Y16","v":0},12.45,{"$f":"(AI16-AE16)/AI16","v":0},null,{"$f":"+C16","v":"RS"},{"$f":"SUM(AL16:AN16)+AG16","v":12.45},null,null,{"$f":"ROUND(AE16/(1-VLOOKUP(AH16,Group,2,FALSE)),2)","v":12.45},{"$f":"IF(VLOOKUP(AH16,Group,3,FALSE)=\"YES\",VLOOKUP(ROUND(ROUND(AL16,1)-AL16,2),Round,2,FALSE)+VLOOKUP(AH16,Group,4,FALSE),0)","v":0},{"$f":"IF(VLOOKUP(AH16,Group,5,FALSE)=\"\",0,ROUND(AL16-0.04999,1)-AL16+AO16)","v":0},{"$f":"IF(VLOOKUP(AH16,Group,5,FALSE)=\"\",\"\",VLOOKUP(AH16,Group,5,FALSE))","v":""},null,"X"]
["TR1438U",null,"RS","RTC - All Other",null,"RSTRTR1438U",null,"3/8 x 1/4",null,"TR1438U",null,"- Soft Grip, Stainless Steel, U-Notch",null,null,null,null,"RTC",null,"Stock","new",{"$f":"IF(Suggested=\"Yes\",'Price List'!AC17,'Price List'!AI17)","v":12.45},"EA",{"$f":"+Instructions!$B$3","v":"N"},null,{"$f":"+Instructions!$D$22","v":0},{"$f":"ROUND($AC17*(1-Y17)+0.004999,2)","v":12.45},null,"new",12.45,{"$f":"+Y17","v":0},{"$f":"+Z17","v":12.45},{"$f":"(AI17-AE17)/AI17","v":0},null,{"$f":"+C17","v":"RS"},{"$f":"SUM(AL17:AN17)+AG17","v":12.45},null,null,{"$f":"ROUND(AE17/(1-VLOOKUP(AH17,Group,2,FALSE)),2)","v":12.45},{"$f":"IF(VLOOKUP(AH17,Group,3,FALSE)=\"YES\",VLOOKUP(ROUND(ROUND(AL17,1)-AL17,2),Round,2,FALSE)+VLOOKUP(AH17,Group,4,FALSE),0)","v":0},{"$f":"IF(VLOOKUP(AH17,Group,5,FALSE)=\"\",0,ROUND(AL17-0.04999,1)-AL17+AO17)","v":0},{"$f":"IF(VLOOKUP(AH17,Group,5,FALSE)=\"\",\"\",VLOOKUP(AH17,Group,5,FALSE))","v":""},null,"X"]
["TR1412U",null,"RS","RTC - All Other",null,"RSTRTR1412U",null,"1/2 x 1/4",null,"TR1412U",null,"- Soft Grip, Stainless Steel, U-Notch",null,null,null,null,"RTC",null,"Stock","new",{"$f":"IF(Suggested=\"Yes\",'Price List'!AC18,'Price List'!AI18)","v":12.45},"EA",{"$f":"+Instructions!$B$3","v":"N"},null,{"$f":"+Instructions!$D$22","v":0},{"$f":"ROUND($AC18*(1-Y18)+0.004999,2)","v":12.45},null,"new",12.45,{"$f":"+Y18","v":0},12.45,{"$f":"(AI18-AE18)/AI18","v":0},null,{"$f":"+C18","v":"RS"},{"$f":"SUM(AL18:AN18)+AG18","v":12.45},null,null,{"$f":"ROUND(AE18/(1-VLOOKUP(AH18,Group,2,FALSE)),2)","v":12.45},{"$f":"IF(VLOOKUP(AH18,Group,3,FALSE)=\"YES\",VLOOKUP(ROUND(ROUND(AL18,1)-AL18,2),Round,2,FALSE)+VLOOKUP(AH18,Group,4,FALSE),0)","v":0},{"$f":"IF(VLOOKUP(AH18,Group,5,FALSE)=\"\",0,ROUND(AL18-0.04999,1)-AL18+AO18)","v":0},{"$f":"IF(VLOOKUP(AH18,Group,5,FALSE)=\"\",\"\",VLOOKUP(AH18,Group,5,FALSE))","v":""},null,"X"]
["TR1212SQ",null,"RS","RTC - All Other",null,"RSTRTR1212SQ",null,"1/2 x 1/2",null,"TR1212SQ",null,"- Soft Grip, Stainless Steel, Sq-Notch",null,null,null,null,"RTC",null,"Stock","new",{"$f":"IF(Suggested=\"Yes\",'Price List'!AC19,'Price List'!AI19)","v":12.45},"EA",{"$f":"+Instructions!$B$3","v":"N"},null,{"$f":"+Instructions!$D$22","v":0},{"$f":"ROUND($AC19*(1-Y19)+0.004999,2)","v":12.45},null,"new",12.45,{"$f":"+Y19","v":0},12.45,{"$f":"(AI19-AE19)/AI19","v":0},null,{"$f":"+C19","v":"RS"},{"$f":"SUM(AL19:AN19)+AG19","v":12.45},null,null,{"$f":"ROUND(AE19/(1-VLOOKUP(AH19,Group,2,FALSE)),2)","v":12.45},{"$f":"IF(VLOOKUP(AH19,Group,3,FALSE)=\"YES\",VLOOKUP(ROUND(ROUND(AL19,1)-AL19,2),Round,2,FALSE)+VLOOKUP(AH19,Group,4,FALSE),0)","v":0},{"$f":"IF(VLOOKUP(AH19,Group,5,FALSE)=\"\",0,ROUND(AL19-0.04999,1)-AL19+AO19)","v":0},{"$f":"IF(VLOOKUP(AH19,Group,5,FALSE)=\"\",\"\",VLOOKUP(AH19,Group,5,FALSE))","v":""},null,"X"]
[null,null,null,null,null,null,null,null,null,null,null,null,null,null,null,null,null,null,null,null,null,null,null,null,null,null,null,null,null,null,null,null,null,null,null,null,null,null,null,null,null,null,"X"]
[null,null,null,null,null,"Euro-Notched - Trowels",null,null,null,null,null,null,null,null,null,null,null,null,null,null,null,null,null,null,null,null,null,null,null,null,null,null,null,null,null,null,null,null,null,null,null,null,"X"]
["TRTIGER",null,"RS","RTC - All Other",null,"RSTRTRTIGER",null,"Euro-Notch",null,"TRTIGER",null,"- Soft Grip, Stainless Steel",null,null,null,null,"RTC",null,"Stock","new",{"$f":"IF(Suggested=\"Yes\",'Price List'!AC22,'Price List'!AI22)","v":12.45},"EA",{"$f":"+Instructions!$B$3","v":"N"},null,{"$f":"+Instructions!$D$22","v":0},{"$f":"ROUND($AC22*(1-Y22)+0.004999,2)","v":12.45},null,"new",12.45,{"$f":"+Y22","v":0},{"$f":"+Z22","v":12.45},{"$f":"(AI22-AE22)/AI22","v":0},null,{"$f":"+C22","v":"RS"},{"$f":"SUM(AL22:AN22)+AG22","v":12.45},null,null,{"$f":"ROUND(AE22/(1-VLOOKUP(AH22,Group,2,FALSE)),2)","v":12.45},{"$f":"IF(VLOOKUP(AH22,Group,3,FALSE)=\"YES\",VLOOKUP(ROUND(ROUND(AL22,1)-AL22,2),Round,2,FALSE)+VLOOKUP(AH22,Group,4,FALSE),0)","v":0},{"$f":"IF(VLOOKUP(AH22,Group,5,FALSE)=\"\",0,ROUND(AL22-0.04999,1)-AL22+AO22)","v":0},{"$f":"IF(VLOOKUP(AH22,Group,5,FALSE)=\"\",\"\",VLOOKUP(AH22,Group,5,FALSE))","v":""},null,"X"]
[null,null,null,null,null,null,null,null,null,null,null,null,null,null,null,null,null,null,null,null,null,null,null,null,null,null,null,null,null,null,null,null,null,null,null,null,null,null,null,null,null,null,"X"]
[null,null,null,null,null,"Schluter Sized - Trowels",null,null,null,null,null,null,null,null,null,null,null,null,null,null,null,null,null,null,null,null,null,null,null,null,null,null,null,null,null,null,null,null,null,null,null,null,"X"]
["TRL-KER",null,"SH","Schluter - Trowels",null,"SHTRLKER6",null,"1/8 x 1/8",null,"TRL-KER",null,"Schluter Kerdi trowel",null,null,null,null,"Schluter",null,null,null,{"$f":"IF(Suggested=\"Yes\",'Price List'!AC25,'Price List'!AI25)","v":25.7},"EA",{"$f":"+Instructions!$B$3","v":"N"},null,{"$f":"+Instructions!$D$22","v":0},{"$f":"ROUND($AC25*(1-Y25)+0.004999,2)","v":25.7},null,"YES",25.7,{"$f":"+Y25","v":0},{"$f":"+Z25","v":25.7},{"$f":"(AI25-AE25)/AI25","v":0},null,{"$f":"+C25","v":"SH"},{"$f":"SUM(AL25:AN25)+AG25","v":25.7},null,null,{"$f":"ROUND(AE25/(1-VLOOKUP(AH25,Group,2,FALSE)),2)","v":25.7},{"$f":"IF(VLOOKUP(AH25,Group,3,FALSE)=\"YES\",VLOOKUP(ROUND(ROUND(AL25,1)-AL25,2),Round,2,FALSE)+VLOOKUP(AH25,Group,4,FALSE),0)","v":0},{"$f":"IF(VLOOKUP(AH25,Group,5,FALSE)=\"\",0,ROUND(AL25-0.04999,1)-AL25+AO25)","v":0},{"$f":"IF(VLOOKUP(AH25,Group,5,FALSE)=\"\",\"\",VLOOKUP(AH25,Group,5,FALSE))","v":""},null,"X"]
["14-10SS",null,"TR","Troxell - All Other",null,"TX1410SS",null,"1/8 x 1/8",null,"14-10SS",null,"Kerdi-Size Trowel, Soft Grip, Stainless",null,null,null,null,"Troxell",null,"Stock",null,{"$f":"IF(Suggested=\"Yes\",'Price List'!AC26,'Price List'!AI26)","v":13.95},"EA",{"$f":"+Instructions!$B$3","v":"N"},null,{"$f":"+Instructions!$D$22","v":0},{"$f":"ROUND($AC26*(1-Y26)+0.004999,2)","v":13.95},null,"YES",13.95,{"$f":"+Y26","v":0},{"$f":"+Z26","v":13.95},{"$f":"(AI26-AE26)/AI26","v":0},null,{"$f":"+C26","v":"TR"},{"$f":"SUM(AL26:AN26)+AG26","v":13.95},null,null,{"$f":"ROUND(AE26/(1-VLOOKUP(AH26,Group,2,FALSE)),2)","v":13.95},{"$f":"IF(VLOOKUP(AH26,Group,3,FALSE)=\"YES\",VLOOKUP(ROUND(ROUND(AL26,1)-AL26,2),Round,2,FALSE)+VLOOKUP(AH26,Group,4,FALSE),0)","v":0},{"$f":"IF(VLOOKUP(AH26,Group,5,FALSE)=\"\",0,ROUND(AL26-0.04999,1)-AL26+AO26)","v":0},{"$f":"IF(VLOOKUP(AH26,Group,5,FALSE)=\"\",\"\",VLOOKUP(AH26,Group,5,FALSE))","v":""},null,"X"]
[null,null,null,null,null,null,null,null,null,null,null,null,null,null,null,null,null,null,null,null,null,null,null,null,null,null,null,null,null,null,null,null,null,null,null,null,null,null,null,null,null,null,"X"]
["TRL-DIT",null,"SH","Schluter - Trowels",null,"SHTRLDIT6",null,"11/64 x 11/64",null,"TRL-DIT",null,"Schluter Ditra trowel",null,null,null,null,"Schluter",null,null,null,{"$f":"IF(Suggested=\"Yes\",'Price List'!AC28,'Price List'!AI28)","v":25.7},"EA",{"$f":"+Instructions!$B$3","v":"N"},null,{"$f":"+Instructions!$D$22","v":0},{"$f":"ROUND($AC28*(1-Y28)+0.004999,2)","v":25.7},null,"YES",25.7,{"$f":"+Y28","v":0},{"$f":"+Z28","v":25.7},{"$f":"(AI28-AE28)/AI28","v":0},null,{"$f":"+C28","v":"SH"},{"$f":"SUM(AL28:AN28)+AG28","v":25.7},null,null,{"$f":"ROUND(AE28/(1-VLOOKUP(AH28,Group,2,FALSE)),2)","v":25.7},{"$f":"IF(VLOOKUP(AH28,Group,3,FALSE)=\"YES\",VLOOKUP(ROUND(ROUND(AL28,1)-AL28,2),Round,2,FALSE)+VLOOKUP(AH28,Group,4,FALSE),0)","v":0},{"$f":"IF(VLOOKUP(AH28,Group,5,FALSE)=\"\",0,ROUND(AL28-0.04999,1)-AL28+AO28)","v":0},{"$f":"IF(VLOOKUP(AH28,Group,5,FALSE)=\"\",\"\",VLOOKUP(AH28,Group,5,FALSE))","v":""},null,"X"]
["14-20SS",null,"TR","Troxell - All Other",null,"TX1420SS",null,"11/64 x 11/64",null,"14-20SS",null,"Ditra-Size Trowel, Soft Grip, Stainless",null,null,null,null,"Troxell",null,"Stock",null,{"$f":"IF(Suggested=\"Yes\",'Price List'!AC29,'Price List'!AI29)","v":13.95},"EA",{"$f":"+Instructions!$B$3","v":"N"},null,{"$f":"+Instructions!$D$22","v":0},{"$f":"ROUND($AC29*(1-Y29)+0.004999,2)","v":13.95},null,"YES",13.95,{"$f":"+Y29","v":0},{"$f":"+Z29","v":13.95},{"$f":"(AI29-AE29)/AI29","v":0},null,{"$f":"+C29","v":"TR"},{"$f":"SUM(AL29:AN29)+AG29","v":13.95},null,null,{"$f":"ROUND(AE29/(1-VLOOKUP(AH29,Group,2,FALSE)),2)","v":13.95},{"$f":"IF(VLOOKUP(AH29,Group,3,FALSE)=\"YES\",VLOOKUP(ROUND(ROUND(AL29,1)-AL29,2),Round,2,FALSE)+VLOOKUP(AH29,Group,4,FALSE),0)","v":0},{"$f":"IF(VLOOKUP(AH29,Group,5,FALSE)=\"\",0,ROUND(AL29-0.04999,1)-AL29+AO29)","v":0},{"$f":"IF(VLOOKUP(AH29,Group,5,FALSE)=\"\",\"\",VLOOKUP(AH29,Group,5,FALSE))","v":""},null,"X"]
[null,null,null,null,null,null,null,null,null,null,null,null,null,null,null,null,null,null,null,null,null,null,null,null,null,null,null,null,null,null,null,null,null,null,null,null,null,null,null,null,null,null,"X"]
["TRL-DHXL",null,"SH","Schluter - Trowels",null,"SHTRLDHXL",null,"1/4 x 1/4",null,"TRL-DHXL",null,"Schluter DitraXL trowel",null,null,null,null,"Schluter",null,null,null,{"$f":"IF(Suggested=\"Yes\",'Price List'!AC31,'Price List'!AI31)","v":25.7},"EA",{"$f":"+Instructions!$B$3","v":"N"},null,{"$f":"+Instructions!$D$22","v":0},{"$f":"ROUND($AC31*(1-Y31)+0.004999,2)","v":25.7},null,"YES",25.7,{"$f":"+Y31","v":0},{"$f":"+Z31","v":25.7},{"$f":"(AI31-AE31)/AI31","v":0},null,{"$f":"+C31","v":"SH"},{"$f":"SUM(AL31:AN31)+AG31","v":25.7},null,null,{"$f":"ROUND(AE31/(1-VLOOKUP(AH31,Group,2,FALSE)),2)","v":25.7},{"$f":"IF(VLOOKUP(AH31,Group,3,FALSE)=\"YES\",VLOOKUP(ROUND(ROUND(AL31,1)-AL31,2),Round,2,FALSE)+VLOOKUP(AH31,Group,4,FALSE),0)","v":0},{"$f":"IF(VLOOKUP(AH31,Group,5,FALSE)=\"\",0,ROUND(AL31-0.04999,1)-AL31+AO31)","v":0},{"$f":"IF(VLOOKUP(AH31,Group,5,FALSE)=\"\",\"\",VLOOKUP(AH31,Group,5,FALSE))","v":""},null,"X"]
["TR1414SQ",null,"RS","RTC - All Other",null,"RSTRTR1414SQ",null,"1/4 x 1/4",null,"TR1414SQ",null,"- Soft Grip, Stainless Steel, Sq-Notch",null,null,null,null,"RTC",null,"Stock","new",{"$f":"IF(Suggested=\"Yes\",'Price List'!AC32,'Price List'!AI32)","v":12.45},"EA",{"$f":"+Instructions!$B$3","v":"N"},null,{"$f":"+Instructions!$D$22","v":0},{"$f":"ROUND($AC32*(1-Y32)+0.004999,2)","v":12.45},null,"new",12.45,{"$f":"+Y32","v":0},{"$f":"+Z32","v":12.45},{"$f":"(AI32-AE32)/AI32","v":0},null,{"$f":"+C32","v":"RS"},{"$f":"SUM(AL32:AN32)+AG32","v":12.45},null,null,{"$f":"ROUND(AE32/(1-VLOOKUP(AH32,Group,2,FALSE)),2)","v":12.45},{"$f":"IF(VLOOKUP(AH32,Group,3,FALSE)=\"YES\",VLOOKUP(ROUND(ROUND(AL32,1)-AL32,2),Round,2,FALSE)+VLOOKUP(AH32,Group,4,FALSE),0)","v":0},{"$f":"IF(VLOOKUP(AH32,Group,5,FALSE)=\"\",0,ROUND(AL32-0.04999,1)-AL32+AO32)","v":0},{"$f":"IF(VLOOKUP(AH32,Group,5,FALSE)=\"\",\"\",VLOOKUP(AH32,Group,5,FALSE))","v":""},null,"X"]
[null,null,null,null,null,null,null,null,null,null,null,null,null,null,null,null,null,null,null,null,null,null,null,null,null,null,null,null,null,null,null,null,null,null,null,null,null,null,null,null,null,null,"X"]
[null,null,null,null,null,"V-Notched - Trowels",null,null,null,null,null,null,null,null,null,null,null,null,null,null,null,null,null,null,null,null,null,null,null,null,null,null,null,null,null,null,null,null,null,null,null,null,"X"]
["TR14316V",null,"RS","RTC - All Other",null,"RSTRTR14316V",null,"3/16 x 1/4",null,"TR14316V",null,"- Soft Grip, Stainless Steel, V-Notch",null,null,null,null,"RTC",null,"Stock","new",{"$f":"IF(Suggested=\"Yes\",'Price List'!AC35,'Price List'!AI35)","v":12.45},"EA",{"$f":"+Instructions!$B$3","v":"N"},null,{"$f":"+Instructions!$D$22","v":0},{"$f":"ROUND($AC35*(1-Y35)+0.004999,2)","v":12.45},null,"new",12.45,{"$f":"+Y35","v":0},12.45,{"$f":"(AI35-AE35)/AI35","v":0},null,{"$f":"+C35","v":"RS"},{"$f":"SUM(AL35:AN35)+AG35","v":12.45},null,null,{"$f":"ROUND(AE35/(1-VLOOKUP(AH35,Group,2,FALSE)),2)","v":12.45},{"$f":"IF(VLOOKUP(AH35,Group,3,FALSE)=\"YES\",VLOOKUP(ROUND(ROUND(AL35,1)-AL35,2),Round,2,FALSE)+VLOOKUP(AH35,Group,4,FALSE),0)","v":0},{"$f":"IF(VLOOKUP(AH35,Group,5,FALSE)=\"\",0,ROUND(AL35-0.04999,1)-AL35+AO35)","v":0},{"$f":"IF(VLOOKUP(AH35,Group,5,FALSE)=\"\",\"\",VLOOKUP(AH35,Group,5,FALSE))","v":""},null,"X"]
[null,null,null,null,null,null,null,null,null,null,null,null,null,null,null,null,null,null,null,null,null,null,null,null,null,null,null,null,null,null,null,null,null,null,null,null,null,null,null,null,null,null,"X"]
[null,null,null,null,null,"Margin Trowels",null,null,null,null,null,null,null,null,null,null,null,null,null,null,null,null,null,null,null,null,null,null,null,null,null,null,null,null,null,null,null,null,null,null,null,null,"X"]
["TRM52",null,"RS","RTC - All Other",null,"RSTRTRM52",null,"5\" x 2\"",null,"TRM52",null,"- Soft Grip, Carbon Steel",null,null,null,null,"RTC",null,"Stock","new",{"$f":"IF(Suggested=\"Yes\",'Price List'!AC38,'Price List'!AI38)","v":5.85},"EA",{"$f":"+Instructions!$B$3","v":"N"},null,{"$f":"+Instructions!$D$22","v":0},{"$f":"ROUND($AC38*(1-Y38)+0.004999,2)","v":5.85},null,"new",5.85,{"$f":"+Y38","v":0},{"$f":"+Z38","v":5.85},{"$f":"(AI38-AE38)/AI38","v":0},null,{"$f":"+C38","v":"RS"},{"$f":"SUM(AL38:AN38)+AG38","v":5.85},null,null,{"$f":"ROUND(AE38/(1-VLOOKUP(AH38,Group,2,FALSE)),2)","v":5.85},{"$f":"IF(VLOOKUP(AH38,Group,3,FALSE)=\"YES\",VLOOKUP(ROUND(ROUND(AL38,1)-AL38,2),Round,2,FALSE)+VLOOKUP(AH38,Group,4,FALSE),0)","v":0},{"$f":"IF(VLOOKUP(AH38,Group,5,FALSE)=\"\",0,ROUND(AL38-0.04999,1)-AL38+AO38)","v":0},{"$f":"IF(VLOOKUP(AH38,Group,5,FALSE)=\"\",\"\",VLOOKUP(AH38,Group,5,FALSE))","v":""},null,"X"]
[null,null,"TR","Troxell - All Other",null,"TX15-582",null,"8\" x 2\"",null,"15-582",null,"- Soft Grip, Stainless Steel",null,null,null,null,"Troxell",null,"Stock",null,{"$f":"IF(Suggested=\"Yes\",'Price List'!AC39,'Price List'!AI39)","v":8.4499999999999993},"EA",{"$f":"+Instructions!$B$3","v":"N"},null,{"$f":"+Instructions!$D$22","v":0},{"$f":"ROUND($AC39*(1-Y39)+0.004999,2)","v":8.4499999999999993},null,"",8.4499999999999993,{"$f":"+Y39","v":0},8.4499999999999993,0,null,{"$f":"+C39","v":"TR"},8.4499999999999993,null,null,8.4499999999999993,0,0,"",null,"X"]
[null,null,null,null,null,null,null,null,null,null,null,null,null,null,null,null,null,null,null,null,null,null,null,null,null,null,null,null,null,null,null,null,null,null,null,null,null,null,null,null,null,null,"X"]
{"$rows_left_out":482}
{"sheet":"Websites","index":3,"n_rows":16,"n_cols":2,"rows_kept":16,"cut":false,"hidden":false,"merged":[]}
["Easy Access Website links"]
[]
["ConestogaTile's Website","www.conestogatile.com"]
[]
["Manufacturer's Home Page"]
["Barwalt","www.barwalt.com"]
["European Tile Masters (ETMM)","www.europeantilemasters"]
["IQ Saws","https://iqpowertools.com/"]
["Mark E. Ind.","www.markeindustries.com"]
["MK Diamond","www.mkdiamond.com"]
["Progress Profiles","www.progressprofiles.com"]
["Rubi Tools","www.rubi.com"]
["Sigma (RTC)","www.rtcproducts.com"]
["Troxell Tools","https://troxellusa.com/"]
[]
["Product","Direct Website Link"]

{"sheet":"Updates","index":4,"n_rows":16,"n_cols":3,"rows_kept":16,"cut":false,"hidden":false,"merged":[]}
[null,"Price List"]
["Mfg","Date","Description"]
[]
["New Products"]
[]
[]
[]
[]
[]
[]
[]
[]
[]
[]
[]
["Discontinued Products"]