{"text_format":"1","workbook":"xlsx","n_sheets":5,"sheets":["Instructions","Index","Price List","Websites","Changes"],"not_rendered":{"charts":0,"images":2,"macros":1,"external_links":1,"defined_names":18,"comments":0,"pivot_tables":0},"unopened":[],"bounds":{"document_bytes":16777216,"sheet_cells":100000,"rows_first":2000,"rows_last":500,"rows_between":2000,"halvings":0,"cell_chars":16384,"cell_head_chars":4096},"cells_cut":0,"cells_raw":0,"read":"whole","date_system":"1900"}

{"sheet":"Instructions","index":0,"n_rows":59,"n_cols":8,"rows_kept":59,"cut":false,"hidden":false,"merged":[[7,2,7,7],[36,3,36,4]]}
["Manufacturer","Laticrete"]
["File as","L"]
["Product Code","I"]
["CCTD Effective Date","6/1/25 (Updated)"]
[]
[]
[]
["Enter your Company Name"]
[]
[null,"Click on \"Index\" to set the print area for the price list index"]
[null,"Then you can send it to print"]
[]
[]
[null,"Click on \"Suggested Price List\" to set the print area for Conestoga Tile's suggested price list."]
[null,"Then you can send it to print"]
[]
[]
[null,"Enter your discount codes if you want a personal net cost sheet."]
[]
[null,"Product"]
{"$rows_left_out":40}
{"sheet":"Index","index":1,"n_rows":87,"n_cols":14,"rows_kept":87,"cut":false,"hidden":false,"merged":[[4,0,4,11],[72,0,72,11],[74,0,74,11],[1,6,1,11],[2,4,2,8]]}
[]
[null,null,null,null,null,null,{"$f":"\"File '\"&Instructions!B2&\"' - \"&Instructions!B1","v":"File 'L' - Laticrete"}]
[]
[]
[{"$f":"\"Price List Index - \"&Instructions!B4","v":"Price List Index - 6/1/25 (Updated)"}]
[]
[]
[]
[]
["Page",null,"Series",null,"Product Type",null,null,"Page",null,"Series",null,"Product Type"]
[null,null,"Mortars & Adhesives",null,null,null,null,13,null,"921 Primer Plus",null,"Underlayment"]
["1",null,"15 Premium Mastic",null,"Mastic",null,null,13,null,"911 Vapor Ban E",null,"Moisture Control"]
["1",null,"209 Floor Mud",null,"Mortar",null,null,14,null,"912 Vapor Ban ER",null,"Moisture Control"]
["1",null,"226 Thick Bed Mortar",null,"Mortar",null,null,14,null,"914 Vapor Ban Primer ER",null,"Moisture Control"]
["1",null,"229 Quick Cure Mortar Bed",null,"Mortar",null,null,14,null,"915 Vapor Ban Primer W",null,"Moisture Control"]
["1",null,"3701 Fortified Mortar Bed",null,"Mortar",null,null,14,null,"NXT Tool Kit",null,"Tools"]
[1,null,"3701 Lite Mortar",null,"Mortar",null,null,14,null,"NIVCOMP Digital Level",null,"Tools"]
["1-2",null,"3701 Lite Mortar R",null,"Mortar",null,null,14,null,"ELEVATION Pins",null,"Tools"]
[2,null,"272 Premium Floor and Wall",null,"Thin-Set Mortar",null,null,14,null,"Pro-Kart",null,"Tools"]
[2,null,"317 Floor and Wall",null,"Thin-Set Mortar",null,null,14,null,"Pro-Mix Station",null,"Tools"]
{"$rows_left_out":68}
{"sheet":"Price List","index":2,"n_rows":1838,"n_cols":41,"rows_kept":1838,"cut":false,"hidden":false,"merged":[[1107,6,1107,16],[1108,6,1108,9],[1108,10,1108,12],[1110,6,1110,9],[1110,10,1110,12],[1109,6,1109,9],[1109,10,1109,12],[1108,13,1108,16],[1109,13,1110,16],[265,6,265,14],[266,6,266,10],[266,11,266,14],[267,6,267,10],[267,11,267,14],[268,6,268,10],[268,11,268,14],[269,6,269,10],[269,11,269,14],[92,6,92,8],[92,9,92,11],[92,12,92,13],[1095,6,1095,16],[1096,6,1096,9],[1096,10,1096,12],[1096,13,1096,14],[1096,15,1096,16],[1097,6,1097,9],[1097,10,1097,12],[1097,13,1097,14],[1097,15,1097,16],[252,6,252,10],[252,11,252,14],[253,6,253,10],[253,11,253,14],[254,6,254,10],[254,11,254,14],[1068,4,1068,16],[1064,4,1064,12],[1066,15,1066,16],[1066,4,1066,12],[1067,4,1067,16],[1054,6,1054,9],[614,3,614,4],[207,6,207,10],[289,11,289,14],[509,6,509,9],[508,6,508,9],[433,13,433,15],[431,6,431,12],[286,6,286,14],[1053,6,1053,9],[1053,10,1053,12],[1053,13,1053,15],[825,8,826,10],[621,3,621,4],[619,3,619,4],[618,3,618,4],[616,7,616,8],[339,11,339,14],[351,11,351,14],[352,11,352,14],[326,11,326,14],[340,11,340,14],[350,6,350,14],[351,6,351,10],[385,6,385,9],[1054,10,1054,12],[1054,13,1054,15],[93,6,93,8],[93,9,93,11],[93,12,93,13],[113,12,113,13],[114,6,114,8],[114,9,114,11],[114,12,114,13],[115,6,115,8],[115,9,115,11],[115,12,115,13],[113,6,113,8],[94,12,94,13],[95,12,95,13],[96,12,96,13],[110,6,110,13],[111,6,111,8],[111,9,111,11],[111,12,111,13],[112,6,112,8],[112,9,112,11],[112,12,112,13],[113,9,113,11],[555,10,555,15],[506,6,506,9],[557,6,557,9],[558,6,558,9],[560,6,560,9],[530,9,531,11],[554,6,554,15],[532,9,532,11],[505,6,505,9],[224,11,224,14],[239,6,239,10],[384,6,384,13],[385,10,385,13],[308,11,308,14],[323,6,323,10],[288,6,288,14],[290,6,290,14],[294,11,294,14],[307,6,307,10],[306,6,306,14],[309,6,309,10],[294,6,294,10],[322,6,322,14],[225,6,225,10],[225,11,225,14],[339,6,339,10],[240,6,240,10],[308,6,308,10],[338,6,338,14],[237,11,237,14],[238,6,238,10],[292,6,292,14],[236,6,236,14],[387,6,387,9],[388,10,388,13],[419,6,419,9],[237,6,237,10],[309,11,309,14],[328,11,328,14],[386,10,386,13],[327,6,327,14],[310,11,310,14],[419,10,419,13],[324,6,324,14],[325,11,325,14],[323,11,323,14],[366,6,366,14],[367,6,367,10],[367,11,367,14],[370,6,370,10],[370,11,370,14],[369,6,369,10],[369,11,369,14],[368,6,368,10],[368,11,368,14],[371,6,371,10],[371,11,371,14],[827,8,827,10],[801,6,801,9],[797,6,797,9],[798,6,798,9],[620,7,620,8],[584,10,584,14],[451,6,452,8],[507,6,507,9],[530,12,530,13],[529,9,529,13],[613,7,613,8],[453,9,453,12],[455,13,455,15],[502,6,503,9],[453,13,453,15],[555,6,556,9],[561,6,561,9],[791,10,791,13],[618,5,618,6],[619,5,619,6],[825,11,825,13],[743,6,743,9],[616,12,616,15],[617,12,617,15],[915,6,915,9],[866,6,866,14],[858,11,858,14],[898,6,898,14],[858,6,858,10],[868,11,868,14],[915,10,915,13],[913,6,913,9],[914,10,914,13],[869,6,869,10],[900,6,900,10],[900,11,900,14],[868,6,868,10],[856,11,856,14],[794,6,794,9],[796,6,796,9],[620,3,620,4],[621,7,621,8],[914,6,914,9],[999,6,999,13],[621,5,621,6],[867,11,867,14],[899,11,899,14],[964,6,964,9],[916,10,916,13],[918,6,918,9],[744,6,744,9],[828,8,828,10],[962,6,962,9],[917,10,917,13],[620,5,620,6],[869,11,869,14],[918,10,918,13],[913,10,913,13],[912,6,912,13],[867,6,867,10],[857,11,857,14],[917,6,917,9],[156,6,156,10],[156,11,156,14],[130,6,130,10],[128,11,128,14],[142,6,142,10],[143,11,143,14],[157,11,157,14],[144,11,144,14],[328,6,328,10],[238,11,238,14],[287,6,287,10],[325,6,325,10],[194,6,194,10],[193,6,193,10],[157,6,157,10],[190,6,190,14],[205,11,205,14],[206,11,206,14],[172,11,172,14],[170,6,170,10],[191,6,191,10],[192,6,192,10],[158,11,158,14],[615,3,615,4],[615,12,615,15],[615,5,615,6],[615,7,615,8],[612,5,612,11],[511,6,511,9],[501,6,501,14],[421,6,421,9],[612,12,613,15],[451,13,452,15],[455,6,455,8],[430,6,430,15],[612,3,613,4],[504,6,504,9],[613,5,613,6],[510,6,510,9],[590,6,590,9],[563,6,563,9],[591,6,591,9],[583,6,583,14],[589,6,589,9],[592,6,592,9],[559,6,559,9],[533,9,533,11],[204,6,204,10],[617,3,617,4],[616,3,616,4],[340,6,340,10],[203,6,203,14],[172,6,172,10],[171,6,171,10],[352,6,352,10],[171,11,171,14],[310,6,310,10],[191,11,191,14],[205,6,205,10],[207,11,207,14],[239,11,239,14],[206,6,206,10],[193,11,193,14],[192,11,192,14],[221,6,221,14],[222,6,222,10],[222,11,222,14],[223,6,223,10],[223,11,223,14],[224,6,224,10],[432,6,432,12],[194,11,194,14],[1827,3,1827,4],[1824,2,1824,19],[404,6,404,9],[453,6,453,8],[502,10,502,14],[916,6,916,9],[740,6,740,9],[855,6,855,14],[611,3,611,11],[454,9,454,12],[454,13,454,15],[454,6,454,8],[450,6,450,15],[451,9,452,12],[616,5,616,6],[738,6,738,9],[824,8,824,13],[586,6,586,9],[857,6,857,10],[856,6,856,10],[1305,6,1305,9],[1304,6,1304,13],[899,6,899,10],[14,30,14,32],[15,13,16,19],[32,6,32,14],[33,6,33,10],[1822,2,1822,19],[144,6,144,10],[400,6,400,9],[434,6,434,12],[402,6,402,9],[326,6,326,10],[593,6,593,9],[307,11,307,14],[240,11,240,14],[204,11,204,14],[291,6,291,10],[291,11,291,14],[289,6,289,10],[287,11,287,14],[250,6,250,14],[251,6,251,10],[251,11,251,14],[169,6,169,14],[293,6,293,10],[293,11,293,14],[10,25,10,32],[13,22,13,23],[13,14,13,19],[11,14,11,15],[10,14,10,19],[10,22,10,23],[96,9,96,11],[33,11,33,14],[34,6,34,10],[36,11,36,14],[34,11,34,14],[35,11,35,14],[19,2,19,19],[18,14,18,15],[35,6,35,10],[36,6,36,10],[77,6,77,14],[68,6,68,10],[68,11,68,14],[64,6,64,14],[65,6,65,10],[65,11,65,14],[66,6,66,10],[66,11,66,14],[67,6,67,10],[67,11,67,14],[91,6,91,13],[78,6,78,10],[78,11,78,14],[128,6,128,10],[170,11,170,14],[79,6,79,10],[79,11,79,14],[158,6,158,10],[80,6,80,10],[80,11,80,14],[142,11,142,14],[130,11,130,14],[143,6,143,10],[129,11,129,14],[127,6,127,14],[81,11,81,14],[141,6,141,14],[129,6,129,10],[81,6,81,10],[95,6,95,8],[96,6,96,8],[94,9,94,11],[95,9,95,11],[94,6,94,8],[155,6,155,14],[420,6,420,9],[418,10,418,13],[418,6,418,9],[431,13,431,15],[455,9,455,12],[386,6,386,9],[403,10,403,13],[399,6,399,13],[388,6,388,9],[417,6,417,9],[387,10,387,13],[401,6,401,9],[400,10,400,13],[417,10,417,13],[404,10,404,13],[401,10,401,13],[421,10,421,13],[432,13,432,15],[420,10,420,13],[434,13,434,15],[433,6,433,12],[402,10,402,13],[416,6,416,13],[403,6,403,9],[1063,15,1063,16],[962,10,962,13],[919,6,919,9],[932,6,932,13],[933,6,933,9],[933,10,933,13],[936,10,936,13],[944,10,944,13],[963,6,963,9],[965,10,965,13],[1000,10,1000,13],[1001,10,1001,13],[963,10,963,13],[943,6,943,9],[945,10,945,13],[942,6,942,9],[1015,6,1015,13],[1016,6,1016,13],[943,10,943,13],[938,6,938,9],[938,10,938,13],[939,6,939,9],[939,10,939,13],[940,6,940,9],[1308,6,1308,9],[1308,10,1308,13],[1307,6,1307,9],[1307,10,1307,13],[1306,10,1306,13],[1066,13,1066,14],[1031,10,1031,12],[1033,10,1033,12],[1030,13,1030,15],[1306,6,1306,9],[1305,10,1305,13],[1052,10,1052,12],[1052,13,1052,15],[1050,6,1050,9],[1062,15,1062,16],[1064,15,1064,16],[1062,4,1062,12],[1032,13,1032,15],[1033,13,1033,15],[1036,10,1036,12],[1035,10,1035,12],[1033,6,1033,9],[1065,15,1065,16],[1032,10,1032,12],[940,10,940,13],[964,10,964,13],[965,6,965,9],[1000,6,1000,9],[982,10,982,13],[983,6,983,9],[983,10,983,13],[984,6,984,9],[984,10,984,13],[985,6,985,9],[985,10,985,13],[986,6,986,9],[986,10,986,13],[981,6,981,13],[919,10,919,13],[966,6,966,9],[966,10,966,13],[1005,6,1005,9],[1001,6,1001,9],[1002,10,1002,13],[1003,6,1003,9],[941,6,941,9],[941,10,941,13],[961,6,961,13],[1003,10,1003,13],[949,6,949,9],[949,10,949,13],[934,6,934,9],[934,10,934,13],[935,6,935,9],[935,10,935,13],[936,6,936,9],[937,6,937,9],[937,10,937,13],[947,6,947,9],[947,10,947,13],[1004,10,1004,13],[942,10,942,13],[1032,6,1032,9],[1065,4,1065,12],[1065,13,1065,14],[1050,10,1050,12],[1050,13,1050,15],[1061,4,1061,16],[944,6,944,9],[1052,6,1052,9],[1031,13,1031,15],[1035,13,1035,15],[1036,13,1036,15],[1034,13,1034,15],[1030,6,1030,9],[1030,10,1030,12],[1037,6,1037,9],[1031,6,1031,9],[1036,6,1036,9],[1037,13,1037,15],[1034,10,1034,12],[1037,10,1037,12],[1034,6,1034,9],[1035,6,1035,9],[1049,6,1049,9],[1049,10,1049,12],[1049,13,1049,15],[1051,6,1051,9],[1051,10,1051,12],[1051,13,1051,15],[1005,10,1005,13],[1004,6,1004,9],[1002,6,1002,9],[945,6,945,9],[946,6,946,9],[946,10,946,13],[1014,6,1014,13],[987,6,987,9],[987,10,987,13],[990,6,990,9],[990,10,990,13],[967,6,967,9],[967,10,967,13],[968,6,968,9],[968,10,968,13],[988,6,988,9],[988,10,988,13],[989,6,989,9],[989,10,989,13],[982,6,982,9],[1064,13,1064,14],[1062,13,1062,14],[1063,13,1063,14],[1063,4,1063,12],[948,6,948,9],[948,10,948,13],[612,16,612,19],[584,6,585,9],[614,5,614,6],[614,7,614,8],[617,7,617,8],[618,12,618,15],[614,12,614,15],[618,7,618,8],[619,7,619,8],[799,6,799,9],[800,6,800,9],[791,6,792,9],[793,6,793,9],[588,6,588,9],[735,6,736,9],[742,6,742,9],[795,6,795,9],[790,6,790,13],[734,6,734,14],[617,5,617,6],[735,10,735,14],[562,6,562,9],[564,6,564,9],[739,6,739,9],[587,6,587,9],[619,12,619,15],[741,6,741,9],[611,12,611,19],[737,6,737,9]]}
[null,"Mortars/Ahesive",null,null,"Size",null,null,null,"Description",null,null,null,null,null,null,null,null,null,{"$f":"IF(Suggested=\"Yes\",AA1,AG1)","v":0.05},"EA",{"$f":"+Instructions!$B$3","v":"I"},null,{"$f":"+Instructions!$C$22","v":0},{"$f":"ROUND($AA1*(1-W1)+0.004999,2)","v":0.05},null,"new",0.05,{"$f":"+W1","v":0},0.05,{"$f":"(AG1-AC1)/AG1","v":0},null,1,{"$f":"SUM(AJ1:AL1)+AE1","v":0.05},null,null,{"$f":"ROUND(AC1/(1-VLOOKUP(AF1,Group,2,FALSE)),2)","v":0.05},{"$f":"IF(VLOOKUP(AF1,Group,5,FALSE)=\"YES\",VLOOKUP(ROUND(ROUND(AJ1,1)-AJ1,2),Round,2,FALSE)+VLOOKUP(AF1,Group,6,FALSE),0)","v":0},{"$f":"IF(VLOOKUP(AF1,Group,7,FALSE)=\"\",0,ROUND(AJ1-0.04999,1)-AJ1+AM1)","v":0},{"$f":"IF(VLOOKUP(AF1,Group,7,FALSE)=\"\",\"\",VLOOKUP(AF1,Group,7,FALSE))","v":""},null,"X"]
[null,"Regular Grouts",null,null,"Size",null,null,null,"Description",null,null,null,null,null,null,null,null,null,{"$f":"IF(Suggested=\"Yes\",AA2,AG2)","v":0.05},"EA",{"$f":"+Instructions!$B$3","v":"I"},null,{"$f":"+Instructions!$C$22","v":0},0.05,null,"new",0.05,0,0.05,0,null,2,0.05,null,null,0.05,0,0,"",null,"X"]
[null,"Epoxy Grouts",null,null,"Size",null,null,null,"Description",null,null,null,null,null,null,null,null,null,0.05,"EA",{"$f":"+Instructions!$B$3","v":"I"},null,{"$f":"+Instructions!$C$22","v":0},0.05,null,"new",0.05,0,0.05,0,null,3,0.05,null,null,0.05,0,0,"",null,"X"]
[null,"Additives",null,null,"Size",null,null,null,"Description",null,null,null,null,null,null,null,null,null,0.05,"EA",{"$f":"+Instructions!$B$3","v":"I"},null,{"$f":"+Instructions!$C$22","v":0},0.05,null,"new",0.05,0,0.05,0,null,4,0.05,null,null,0.05,0,0,"",null,"X"]
[null,"Membranes",null,null,"Size",null,null,null,"Description",null,null,null,null,null,null,null,null,null,0.05,"EA",{"$f":"+Instructions!$B$3","v":"I"},null,{"$f":"+Instructions!$C$22","v":0},0.05,null,"new",0.05,0,0.05,0,null,5,0.05,null,null,0.05,0,0,"",null,"X"]
[null,"Underlayment",null,null,"Size",null,null,null,"Description",null,null,null,null,null,null,null,null,null,0.05,"EA",{"$f":"+Instructions!$B$3","v":"I"},null,{"$f":"+Instructions!$C$22","v":0},0.05,null,"new",0.05,0,0.05,0,null,6,0.05,null,null,0.05,0,0,"",null,"X"]
[null,"Care & Maint.",null,null,"Size",null,null,null,"Description",null,null,null,null,null,null,null,null,null,{"$f":"IF(Suggested=\"Yes\",AA7,AG7)","v":0.05},"EA",{"$f":"+Instructions!$B$3","v":"I"},null,{"$f":"+Instructions!$C$22","v":0},{"$f":"ROUND($AA7*(1-W7)+0.004999,2)","v":0.05},null,"new",0.05,{"$f":"+W7","v":0},{"$f":"+X7","v":0.05},{"$f":"(AG7-AC7)/AG7","v":0},null,7,{"$f":"SUM(AJ7:AL7)+AE7","v":0.05},null,null,{"$f":"ROUND(AC7/(1-VLOOKUP(AF7,Group,2,FALSE)),2)","v":0.05},{"$f":"IF(VLOOKUP(AF7,Group,5,FALSE)=\"YES\",VLOOKUP(ROUND(ROUND(AJ7,1)-AJ7,2),Round,2,FALSE)+VLOOKUP(AF7,Group,6,FALSE),0)","v":0},{"$f":"IF(VLOOKUP(AF7,Group,7,FALSE)=\"\",0,ROUND(AJ7-0.04999,1)-AJ7+AM7)","v":0},{"$f":"IF(VLOOKUP(AF7,Group,7,FALSE)=\"\",\"\",VLOOKUP(AF7,Group,7,FALSE))","v":""},null,"X"]
[null,"Other Items",null,null,"Size",null,null,null,"Description",null,null,null,null,null,null,null,null,null,0.05,"EA",{"$f":"+Instructions!$B$3","v":"I"},null,{"$f":"+Instructions!$C$22","v":0},0.05,null,"new",0.05,0,0.05,0,null,8,0.05,null,null,0.05,0,0,"",null,"X"]
[null,"Format",null,null,null,null,null,null,null,null,null,null,null,null,null,null,"Stock","a",1000,"ABC",null,null,0.1,1000,null,"ABC",1000,0.1,1000,0.1,10,null,1000,null,null,null,null,null,null,null,"X"]
[null,null,null,null,null,null,null,null,null,null,null,null,null,null,null,null,null,null,null,null,null,null,null,null,null,null,null,null,null,null,null,null,null,null,null,null,null,null,null,null,"X"]
[null,null,null,null,null,null,null,null,null,null,null,null,null,null,"Price List",null,null,null,null,null,null,null,"Cust. Cost",null,null,"Customer Cost Calculation",null,null,null,null,null,null,null,null,null,null,null,null,null,null,"X"]
[null,null,null,"Sizes & Shapes",null,null,null,null,null,null,null,null,null,null,"Full Carton",null,"Stock","Note",{"$f":"IF(Suggested=\"Yes\",AA12,AG12)","v":"List Price"},"U/M","Code",null,"Disc.","Net",null,"Chg","List Price","Disc","Act. Cost","GP%","Adj.","Group","Price",null,null,"Calc Price",".05 Round","Cents","Round to",null,"X"]
[null,null,null,null,null,null,null,null,null,null,null,null,null,null,null,null,null,null,null,null,null,null,null,null,null,null,null,null,null,null,null,null,null,null,null,null,null,null,null,null,"X"]
[null,null,null,null,null,null,null,null,null,null,null,null,null,null,{"$f":"\"File '\"&Instructions!B2&\"' - \"&Instructions!B1","v":"File 'L' - Laticrete"},null,null,null,null,null,null,null,"Cost",null,null,null,null,null,null,null,null,null,"Retail Price Calculations",null,null,null,null,null,null,null,"X"]
[null,null,null,null,null,null,null,null,null,null,null,null,null,null,null,null,null,null,null,{"$f":"+Instructions!B4","v":"6/1/25 (Updated)"},null,null,null,null,null,null,null,null,null,null,{"$f":"TODAY()","v":"2026-01-26"},null,null,null,null,null,null,null,null,null,"X"]
[null,null,null,null,null,null,null,null,null,null,null,null,null,{"$f":"IF(Instructions!C8=\"\",\"\",+Instructions!C8)","v":""},null,null,null,null,null,null,null,null,null,null,null,null,null,null,null,null,null,null,null,null,null,null,null,null,null,null,"X"]
[null,null,{"$f":"\"Product Code '\"&Instructions!B3&\"'\"","v":"Product Code 'I'"},null,null,null,null,null,null,null,null,null,null,null,null,null,null,null,null,null,null,null,null,null,null,null,null,null,null,null,null,null,{"$f":"IF(Instructions!$C$8=\"\",\"\",Instructions!$C$8)","v":""},null,null,null,null,null,null,null,"X"]
[null,null,null,null,null,null,null,null,null,null,null,null,null,null,null,null,null,null,null,null,null,null,null,null,null,null,null,null,null,null,null,null,null,null,null,null,null,null,null,null,"X"]
[null,null,"Sizes & Shapes",null,null,null,null,null,null,null,null,null,null,null,"Full Carton",null,"Stock","Note",{"$f":"+S$12","v":"List Price"},"U/M",{"$f":"+U$12","v":"Code"},null,"Disc.","Net",null,"Chg","List Price",{"$f":"+AB$12","v":"Disc"},"Act. Cost","GP%","Adj.",{"$f":"+AF$12","v":"Group"},"Price",null,null,"Calc Price",".05 Round","Cents","Round to",null,"X"]
[null,null,"ALL ITEMS MARKED WITH PACKAGING QUANTITY ARE SOLD IN MULTIPLES OF THAT QUANTITY ONLY",null,null,null,null,null,null,null,null,null,null,null,null,null,null,null,null,null,null,null,null,null,null,null,null,null,null,null,null,null,null,null,null,null,null,null,null,null,"X"]
{"$rows_left_out":1819}
{"sheet":"Websites","index":3,"n_rows":9,"n_cols":2,"rows_kept":9,"cut":false,"hidden":false,"merged":[]}
["Easy Access Website links"]
[]
["ConestogaTile's Website","www.conestogatile.com"]
[]
["Manufacturer's Home Page","www.laticrete.com"]
[]
[]
["Product","Direct Website Link"]
["All Products","https://laticrete.com/en/our-products"]

{"sheet":"Changes","index":4,"n_rows":154,"n_cols":3,"rows_kept":154,"cut":false,"hidden":false,"merged":[[127,0,133,0],[127,1,133,1],[134,0,139,0],[134,1,139,1]]}
["Date"]
["Announced","Series","Description"]
[]
["New Products"]
["2019-01-02","Multimax Lite","Lightweight one-step polymer fortified Large and Heavy Tile mortar for interior and exterior installation."]
["2019-03-01","9209 Fracture Ban SC","A thin, load bearing, self-curing liquid rubber polymer that can be easily applied in a single coat to form a flexible seamless antifracture membrane."]
["2019-03-01","9259 Hydro Ban Cementitious Waterproofing Membrane","A one component, polymer fortified, cement based waterproofing material that mixes only with water."]
["2019-03-01","Hydro Ban Bonding Flange Drain/Tile-In Drain","New Hydro Ban Bonding Flange Drain/Tile-In Drain kits will now include 4\" x 4\" Grates.  (Kits with the 5\" x 5\" Grates are discontinued.)"]
["2019-03-01","Hydro Ban Drain Collars","The HYDRO BAN Deep Drawn Drain Collars are available in 3/4\" and 1-1/2\" depths and a 17\" diameter."]
["2019-03-01","Hydro Ban Drain Grate","New 4\" x 4\" Grate size.  (The 5\" x 5\" Grates are discontinued.)"]
["2019-03-01","Hydro Ban Linear Drain","Hydro Ban Linear Drain is now sold in two parts:  the HYDRO BAN Linear Drain Trough and the HYDRO BAN Linear Drain Grate."]
["2019-03-01","SpectraLOCK PRO Premium TRANSLUCENT Grout","High performance epoxy grout that offers a unique opaque color."]
["2020-03-10","170.5 Sound & Crack Isolation Mat","High performance acoustical underlayment system."]
["2020-03-10","3701 Lite Mortar and 3701 Lite Mortar R","The ultimate lightweight, versatile, high performance non-sag mortar."]
["2020-03-10","Hydro Ban Curb","The Hydro Ban Curb is a 24\" long EPS curb to be used with the Hydro Ban Shower Pan and is sold separately.  The Hydro Ban Curb should be waterproofed using Hydro Ban Sheet Membrane."]
["2020-03-10","Hydro Ban Shower Pan","The Hydro Ban Shower Pan comes packaged with a pro-sloped pan and a piece of Hydro Ban Sheet Membrane to cover the pan."]
["2020-03-10","Hydro Ban Shower Pan Kit","The Hydro Ban Shower Pan Kit allow the contractor to quickly and easily complete a long-lasting installation, without the hassle of determining the essential components required.  This kit comes packaged with the following Hydro Ban accessories:  data sheet, pro-sloped pan, curb(s) to fit longest side of pan, adhesive & sealant 10.3 FL. OZ. cartridge, sheet membrane for walls and for pan, sealing tape for installation, 4 inside corners, 2 outside corners, 1 pipe seal, 1 mixing valve seal & 2 bonding flange drain rings."]
["2020-03-10","NXT Level SP","Medium/coarse-sanded wear surface and self-leveling underlayment."]
["2020-03-10","Select-Bond Adhesive, Rapid Kits, Non-Sag Kits and High Performance Kits.","Modular Adhesive Mortar System"]
["2020-03-10","SpectraLock 1","Pre-Mixed Grout with Epoxy Performance."]
{"$rows_left_out":134}