{"text_format":"1","workbook":"xlsx","n_sheets":5,"sheets":["Instructions","Index","Price List","Websites","Changes"],"not_rendered":{"charts":0,"images":2,"macros":1,"external_links":0,"defined_names":18,"comments":0,"pivot_tables":0},"unopened":[],"bounds":{"document_bytes":16777216,"sheet_cells":100000,"rows_first":2000,"rows_last":500,"rows_between":2000,"halvings":0,"cell_chars":16384,"cell_head_chars":4096},"cells_cut":0,"cells_raw":0,"read":"whole","date_system":"1900"}

{"sheet":"Instructions","index":0,"n_rows":58,"n_cols":10,"rows_kept":58,"cut":false,"hidden":false,"merged":[[7,2,7,7],[36,3,36,4]]}
["Manufacturer","KurbX"]
["File as","K"]
["Product Code","N"]
["CCTD Effective Date","11/1/25 (Updated)"]
[]
[]
[]
["Enter your Company Name"]
[]
[null,"Click on \"Index\" to set the print area for the price list index"]
[null,"Then you can send it to print"]
[]
[]
[null,"Click on \"Suggested Price List\" to set the print area for Conestoga Tile's suggested price list."]
[null,"Then you can send it to print"]
[]
[]
[null,"Enter your discount codes if you want a personal net cost sheet."]
[]
[null,"Product"]
[null,"Code","Disc. %"]
[null,{"$f":"+B3","v":"N"},0,"  This is a \"NET\" price list.  0% is the discount for this spreadsheet"]
[]
[null,"Click on \"Your Cost\" to set the print area for your personal cost report."]
[null,"Then you can send it to print"]
[]
[]
["Discount: ","To help establish your price list, enter the gross profit percent for each type of product."]
[null,"If you want to use Conestoga Tile's list price, leave them blank."]
[]
["Round Nickel: ","If you always want your price to round to the nearest nickel, enter \"YES\"."]
[null,"If you enter \"NO\", it will NOT round to the nearest nickel."]
[]
["Ending Cents: ","If you always want your price to end with a certain cents, enter that cent value."]
[null,"If you leave it \"blank\" will NOT round to this cent value."]
[]
[null,"Group","GP Margin","GP Margin % for",null,"Round Nickel","add/subtract","Ending Cents"]
[null,1,null,"Stocked Pans",null,"No",0]
[null,2,null,"Non-Stock Pans",null,"No",0]
[null,3,null,"Installation Pkg",null,"No",0,null,null," "]
{"$rows_left_out":19}
{"sheet":"Index","index":1,"n_rows":49,"n_cols":6,"rows_kept":49,"cut":false,"hidden":false,"merged":[[5,0,5,10],[46,0,46,10],[48,0,48,10],[2,5,2,10],[10,2,10,8]]}
[]
[]
[null,null,null,null,null,{"$f":"\"File '\"&Instructions!B2&\"' - \"&Instructions!B1","v":"File 'K' - KurbX"}]
[]
[]
[{"$f":"\"Price List Index - \"&Instructions!B4","v":"Price List Index - 11/1/25 (Updated)"}]
[]
[]
[]
[]
["Page",null,"Series / Product Type"]
[]
[]
[]
[]
[]
[]
[]
[]
[]
[]
[]
[]
[]
[]
[]
[]
[]
[]
[]
[]
[]
[]
[]
[]
[]
[]
[]
[]
[]
{"$rows_left_out":10}
{"sheet":"Price List","index":2,"n_rows":181,"n_cols":42,"rows_kept":181,"cut":false,"hidden":false,"merged":[[12,14,12,20],[13,31,13,33],[10,15,10,16],[9,15,9,20],[9,23,9,24],[9,26,9,33],[12,23,12,24],[18,2,18,19],[170,3,170,4],[17,15,17,16],[164,2,164,20],[166,2,166,20]]}
[null,"Stocked Pans",null,null,"Size",null,"Item #",null,"Description",null,null,null,null,null,null,null,null,null,null,{"$f":"IF(Suggested=\"Yes\",AB1,AH1)","v":0.05},"EA",{"$f":"+Instructions!$B$3","v":"N"},null,{"$f":"+Instructions!$C$22","v":0},{"$f":"ROUND($AB1*(1-X1)+0.004999,2)","v":0.05},null,"new",0.05,{"$f":"+X1","v":0},0.05,{"$f":"(AH1-AD1)/AH1","v":0},null,1,{"$f":"SUM(AK1:AM1)+AF1","v":0.05},null,null,{"$f":"ROUND(AD1/(1-VLOOKUP(AG1,Group,2,FALSE)),2)","v":0.05},{"$f":"IF(VLOOKUP(AG1,Group,5,FALSE)=\"YES\",VLOOKUP(ROUND(ROUND(AK1,1)-AK1,2),Round,2,FALSE)+VLOOKUP(AG1,Group,6,FALSE),0)","v":0},{"$f":"IF(VLOOKUP(AG1,Group,7,FALSE)=\"\",0,ROUND(AK1-0.04999,1)-AK1+AN1)","v":0},{"$f":"IF(VLOOKUP(AG1,Group,7,FALSE)=\"\",\"\",VLOOKUP(AG1,Group,7,FALSE))","v":""},null,"X"]
[null,"Non-Stock Pans",null,null,"Size",null,"Item #",null,"Description",null,null,null,null,null,null,null,null,null,null,{"$f":"IF(Suggested=\"Yes\",AB2,AH2)","v":0.05},"EA",{"$f":"+Instructions!$B$3","v":"N"},null,{"$f":"+Instructions!$C$22","v":0},0.05,null,"new",0.05,0,0.05,0,null,2,0.05,null,null,0.05,0,0,"",null,"X"]
[null,"Installation Pkg",null,null,"Size",null,"Item #",null,"Description",null,null,null,null,null,null,null,null,null,null,{"$f":"IF(Suggested=\"Yes\",AB3,AH3)","v":0.05},"EA",{"$f":"+Instructions!$B$3","v":"N"},null,{"$f":"+Instructions!$C$22","v":0},{"$f":"ROUND($AB3*(1-X3)+0.004999,2)","v":0.05},null,"new",0.05,{"$f":"+X3","v":0},{"$f":"+Y3","v":0.05},{"$f":"(AH3-AD3)/AH3","v":0},null,3,{"$f":"SUM(AK3:AM3)+AF3","v":0.05},null,null,{"$f":"ROUND(AD3/(1-VLOOKUP(AG3,Group,2,FALSE)),2)","v":0.05},{"$f":"IF(VLOOKUP(AG3,Group,5,FALSE)=\"YES\",VLOOKUP(ROUND(ROUND(AK3,1)-AK3,2),Round,2,FALSE)+VLOOKUP(AG3,Group,6,FALSE),0)","v":0},{"$f":"IF(VLOOKUP(AG3,Group,7,FALSE)=\"\",0,ROUND(AK3-0.04999,1)-AK3+AN3)","v":0},{"$f":"IF(VLOOKUP(AG3,Group,7,FALSE)=\"\",\"\",VLOOKUP(AG3,Group,7,FALSE))","v":""},null,"X"]
[null,"Drains",null,null,"Size",null,"Item #",null,"Description",null,null,null,null,null,null,null,null,null,null,0.05,"EA",{"$f":"+Instructions!$B$3","v":"N"},null,{"$f":"+Instructions!$C$22","v":0},0.05,null,"new",0.05,0,0.05,0,null,4,0.05,null,null,0.05,0,0,"",null,"X"]
[null,"Setting Materials",null,null,"Size",null,"Item #",null,"Description",null,null,null,null,null,null,null,null,null,null,0.05,"EA",{"$f":"+Instructions!$B$3","v":"N"},null,{"$f":"+Instructions!$C$22","v":0},0.05,null,"new",0.05,0,0.05,0,null,5,0.05,null,null,0.05,0,0,"",null,"X"]
[null,0,null,null,"Size",null,"Item #",null,"Description",null,null,null,null,null,null,null,null,null,null,0,"EA",{"$f":"+Instructions!$B$3","v":"N"},null,{"$f":"+Instructions!$C$22","v":0},0,null,"new",0,0,0,{"$error":"#DIV/0!"},null,6,0,null,null,0,0,0,"",null,"X"]
[null,0,null,null,"Size",null,"Item #",null,"Description",null,null,null,null,null,null,null,null,null,null,0,"EA",{"$f":"+Instructions!$B$3","v":"N"},null,{"$f":"+Instructions!$C$22","v":0},0,null,"new",0,0,0,{"$error":"#DIV/0!"},null,7,0,null,null,0,0,0,"",null,"X"]
[null,"Format",null,null,null,null,null,null,null,null,null,null,null,null,null,null,null,"Stock","a",1000,"ABC",null,null,0.1,1000,null,"ABC",1000,0.1,1000,0.1,10,null,1000,null,null,null,null,null,null,null,"X"]
[null,null,null,null,null,null,null,null,null,null,null,null,null,null,null,null,null,null,null,null,null,null,null,null,null,null,null,null,null,null,null,null,null,null,null,null,null,null,null,null,null,"X"]
[null,null,null,null,null,null,null,null,null,null,null,null,null,null,null,"Price List",null,null,null,null,null,null,null,"Cust. Cost",null,null,"Customer Cost Calculation",null,null,null,null,null,null,null,null,null,null,null,null,null,null,"X"]
[null,null,null,"Sizes & Shapes",null,null,null,null,null,null,null,null,null,null,null,"Full Carton",null,"Stock","Note",{"$f":"IF(Suggested=\"Yes\",AB11,AH11)","v":"Net Price"},"U/M","Code",null,"Disc.","Net",null,"Chg","Net Price","Disc","Act. Cost","GP%","Adj.","Group","Price",null,null,"Calc Price",".05 Round","Cents","Round to",null,"X"]
[null,null,null,null,null,null,null,null,null,null,null,null,null,null,null,null,null,null,null,null,null,null,null,null,null,null,null,null,null,null,null,null,null,null,null,null,null,null,null,null,null,"X"]
[null,null,null,null,null,null,null,null,null,null,null,null,null,null,{"$f":"\"File '\"&Instructions!B2&\"' - \"&Instructions!B1","v":"File 'K' - KurbX"},null,null,null,null,null,null,null,null,"Cost",null,null,null,null,null,null,null,null,null,"Retail Price Calculations",null,null,null,null,null,null,null,"X"]
[null,null,null,null,null,null,null,null,null,null,null,null,null,null,null,null,null,null,null,null,{"$f":"+Instructions!B4","v":"11/1/25 (Updated)"},null,null,null,null,null,null,null,null,null,null,{"$f":"TODAY()","v":"2025-11-03"},null,null,null,null,null,null,null,null,null,"X"]
[null,null,null,null,null,null,null,null,null,null,null,null,null,null,null,null,null,null,null,null,null,null,null,null,null,null,null,null,null,null,null,null,null,null,null,null,null,null,null,null,null,"X"]
[null,null,{"$f":"\"Product Code '\"&Instructions!B3&\"'\"","v":"Product Code 'N'"},null,null,null,null,null,null,null,null,null,null,null,null,null,null,null,null,null,null,null,null,null,null,null,null,null,null,null,null,null,null,{"$f":"IF(Instructions!$C$8=\"\",\"\",Instructions!$C$8)","v":""},null,null,null,null,null,null,null,"X"]
[null,null,null,null,null,null,null,null,null,null,null,null,null,null,null,null,null,null,null,null,null,null,null,null,null,null,null,null,null,null,null,null,null,null,null,null,null,null,null,null,null,"X"]
[null,null,"Sizes & Shapes",null,null,null,null,null,null,null,null,null,null,null,null,null,null,"Stock","Note",{"$f":"+T$11","v":"Net Price"},"U/M",{"$f":"+V$11","v":"Code"},null,"Disc.","Net",null,"Chg","Net Price",{"$f":"+AC$11","v":"Disc"},"Act. Cost","GP%","Adj.",{"$f":"+AG$11","v":"Group"},"Price",null,null,"Calc Price",".05 Round","Cents","Round to",null,"X"]
[null,null,"PRICING LISTED IS NET PRICING. TRADE DISCOUNTS DO NOT APPLY.",null,null,null,null,null,null,null,null,null,null,null,null,null,null,null,null,null,null,null,null,null,null,null,null,null,null,null,null,null,null,null,null,null,null,null,null,null,null,"X"]
[null,null,null,null,null,null,null,null,null,null,null,null,null,null,null," ",null,null,null,null,null,null,null,null,null,null,null,null,null,null,null,null,null,null,null,null,null,null,null,null,null,"X"]
[null,null,"Step 1:  Choose a Shower Pan",null,null,null,null,null,null,null,null,null,null,null,null,null,null,null,null,null,null,null,null,null,null,null,null,null,null,null,null,null,null,null,null,null,null,null,null,null,null,"X"]
[null,null,null,null,null,null,null,null,null,null,null,null,null,null,null," ",null,null,null,null,null,null,null,null,null,null,null,null,null,null,null,null,null,null,null,null,null,null,null,null,null,"X"]
[null,null,"KurbX - Customizable Structural Shower Pans",null,null,null,null,null,null,null,null,null,null,null,null,null,null,null,"Item # Lookup:","KUSHPAN"]
[null,null,null,null,null,null,null,null,null,null,null,null,null,null,null," ",null,null,null,null,null,null,null,null,null,null,null,null,null,null,null,null,null,null,null,null,null,null,null,null,null,"X"]
[null,"Stocked Pans",null,null,"60\" x 36\"",null,"SB6036-CD",null,null,"Center Drain",null,null,null,null,null," ",null,"Stock",null,{"$f":"IF(Suggested=\"Yes\",AB25,AH25)","v":561.65},"EA",{"$f":"+Instructions!$B$3","v":"N"},null,{"$f":"+Instructions!$C$22","v":0},{"$f":"ROUND($AB25*(1-X25)+0.004999,2)","v":561.65},null,"",561.65,{"$f":"+X25","v":0},{"$f":"+Y25","v":561.65},{"$f":"(AH25-AD25)/AH25","v":0},null,1,{"$f":"SUM(AK25:AM25)+AF25","v":561.65},null,null,{"$f":"ROUND(AD25/(1-VLOOKUP(AG25,Group,2,FALSE)),2)","v":561.65},{"$f":"IF(VLOOKUP(AG25,Group,5,FALSE)=\"YES\",VLOOKUP(ROUND(ROUND(AK25,1)-AK25,2),Round,2,FALSE)+VLOOKUP(AG25,Group,6,FALSE),0)","v":0},{"$f":"IF(VLOOKUP(AG25,Group,7,FALSE)=\"\",0,ROUND(AK25-0.04999,1)-AK25+AN25)","v":0},{"$f":"IF(VLOOKUP(AG25,Group,7,FALSE)=\"\",\"\",VLOOKUP(AG25,Group,7,FALSE))","v":""},null,"X"]
[null,"Stocked Pans",null,null,"60\" x 36\"",null,"SB6036-OD-TR",null,null,"Off-Set Drain",null,null,null,null,null," ",null,"Stock",null,{"$f":"IF(Suggested=\"Yes\",AB26,AH26)","v":561.65},"EA",{"$f":"+Instructions!$B$3","v":"N"},null,{"$f":"+Instructions!$C$22","v":0},{"$f":"ROUND($AB26*(1-X26)+0.004999,2)","v":561.65},null,"",561.65,{"$f":"+X26","v":0},{"$f":"+Y26","v":561.65},{"$f":"(AH26-AD26)/AH26","v":0},null,1,{"$f":"SUM(AK26:AM26)+AF26","v":561.65},null,null,{"$f":"ROUND(AD26/(1-VLOOKUP(AG26,Group,2,FALSE)),2)","v":561.65},{"$f":"IF(VLOOKUP(AG26,Group,5,FALSE)=\"YES\",VLOOKUP(ROUND(ROUND(AK26,1)-AK26,2),Round,2,FALSE)+VLOOKUP(AG26,Group,6,FALSE),0)","v":0},{"$f":"IF(VLOOKUP(AG26,Group,7,FALSE)=\"\",0,ROUND(AK26-0.04999,1)-AK26+AN26)","v":0},{"$f":"IF(VLOOKUP(AG26,Group,7,FALSE)=\"\",\"\",VLOOKUP(AG26,Group,7,FALSE))","v":""},null,"X"]
[null,"Stocked Pans",null,null,"48\" x 48\"",null,"SB4848-CD",null,null,"Center Drain",null,null,null,null,null," ",null,"Stock",null,{"$f":"IF(Suggested=\"Yes\",AB27,AH27)","v":577},"EA",{"$f":"+Instructions!$B$3","v":"N"},null,{"$f":"+Instructions!$C$22","v":0},{"$f":"ROUND($AB27*(1-X27)+0.004999,2)","v":577},null,"",577,{"$f":"+X27","v":0},{"$f":"+Y27","v":577},{"$f":"(AH27-AD27)/AH27","v":0},null,1,{"$f":"SUM(AK27:AM27)+AF27","v":577},null,null,{"$f":"ROUND(AD27/(1-VLOOKUP(AG27,Group,2,FALSE)),2)","v":577},{"$f":"IF(VLOOKUP(AG27,Group,5,FALSE)=\"YES\",VLOOKUP(ROUND(ROUND(AK27,1)-AK27,2),Round,2,FALSE)+VLOOKUP(AG27,Group,6,FALSE),0)","v":0},{"$f":"IF(VLOOKUP(AG27,Group,7,FALSE)=\"\",0,ROUND(AK27-0.04999,1)-AK27+AN27)","v":0},{"$f":"IF(VLOOKUP(AG27,Group,7,FALSE)=\"\",\"\",VLOOKUP(AG27,Group,7,FALSE))","v":""},null,"X"]
[null,"Stocked Pans",null,null,"60\" x 48\"",null,"SB6048-CD",null,null,"Center Drain",null,null,null,null,null," ",null,"Stock",null,{"$f":"IF(Suggested=\"Yes\",AB28,AH28)","v":602.45000000000005},"EA",{"$f":"+Instructions!$B$3","v":"N"},null,{"$f":"+Instructions!$C$22","v":0},{"$f":"ROUND($AB28*(1-X28)+0.004999,2)","v":602.45000000000005},null,"",602.45000000000005,0,602.45000000000005,0,null,1,602.45000000000005,null,null,602.45000000000005,0,0,"",null,"X"]
[null,"Stocked Pans",null,null,"59\" x 59\"",null,"SB6060-CD",null,null,"Center Drain",null,null,null,null,null," ",null,"Stock",null,{"$f":"IF(Suggested=\"Yes\",AB29,AH29)","v":703.25},"EA",{"$f":"+Instructions!$B$3","v":"N"},null,{"$f":"+Instructions!$C$22","v":0},{"$f":"ROUND($AB29*(1-X29)+0.004999,2)","v":703.25},null,"",703.25,0,703.25,0,null,1,703.25,null,null,703.25,0,0,"",null,"X"]
[null,"Stocked Pans",null,null,"71\" x 47-1/4\"",null,"SB7248-CD",null,null,"Center Drain",null,null,null,null,null," ",null,"Stock",null,{"$f":"IF(Suggested=\"Yes\",AB30,AH30)","v":661.7},"EA",{"$f":"+Instructions!$B$3","v":"N"},null,{"$f":"+Instructions!$C$22","v":0},{"$f":"ROUND($AB30*(1-X30)+0.004999,2)","v":661.7},null,"",661.7,{"$f":"+X30","v":0},{"$f":"+Y30","v":661.7},{"$f":"(AH30-AD30)/AH30","v":0},null,1,{"$f":"SUM(AK30:AM30)+AF30","v":661.7},null,null,{"$f":"ROUND(AD30/(1-VLOOKUP(AG30,Group,2,FALSE)),2)","v":661.7},{"$f":"IF(VLOOKUP(AG30,Group,5,FALSE)=\"YES\",VLOOKUP(ROUND(ROUND(AK30,1)-AK30,2),Round,2,FALSE)+VLOOKUP(AG30,Group,6,FALSE),0)","v":0},{"$f":"IF(VLOOKUP(AG30,Group,7,FALSE)=\"\",0,ROUND(AK30-0.04999,1)-AK30+AN30)","v":0},{"$f":"IF(VLOOKUP(AG30,Group,7,FALSE)=\"\",\"\",VLOOKUP(AG30,Group,7,FALSE))","v":""},null,"X"]
[null,null,null,null,null,null,null,null,null,null,null,null,null,null,null," ",null,null,null,null,null,null,null,null,null,null,null,null,null,null,null,null,null,null,null,null,null,null,null,null,null,"X"]
[null,null,"ExtendIT - Shower Pan Filler",null,null,null,null,null,null,null,null,null,null,null,null," ",null,null,"Item # Lookup:","KUSHPAN",null,null,null,null,null,null,null,null,null,null,null,null,null,null,null,null,null,null,null,null,null,"X"]
[null,null,null,null,null,null,null,null,null,null,null,null,null,null,null," ",null,null,null,null,null,null,null,null,null,null,null,null,null,null,null,null,null,null,null,null,null,null,null,null,null,"X"]
[null,"Stocked Pans",null,null,"3\" x 48\"",null,"3-ExtendIT-48",null,null,"Extend-It Mini Pitch Filler (2 Pack)",null,null,null,null,null," ",null,"Stock",null,{"$f":"IF(Suggested=\"Yes\",AB34,AH34)","v":30.3},"EA",{"$f":"+Instructions!$B$3","v":"N"},null,{"$f":"+Instructions!$C$22","v":0},{"$f":"ROUND($AB34*(1-X34)+0.004999,2)","v":30.3},null,"",30.3,{"$f":"+X34","v":0},{"$f":"+Y34","v":30.3},{"$f":"(AH34-AD34)/AH34","v":0},null,1,{"$f":"SUM(AK34:AM34)+AF34","v":30.3},null,null,{"$f":"ROUND(AD34/(1-VLOOKUP(AG34,Group,2,FALSE)),2)","v":30.3},{"$f":"IF(VLOOKUP(AG34,Group,5,FALSE)=\"YES\",VLOOKUP(ROUND(ROUND(AK34,1)-AK34,2),Round,2,FALSE)+VLOOKUP(AG34,Group,6,FALSE),0)","v":0},{"$f":"IF(VLOOKUP(AG34,Group,7,FALSE)=\"\",0,ROUND(AK34-0.04999,1)-AK34+AN34)","v":0},{"$f":"IF(VLOOKUP(AG34,Group,7,FALSE)=\"\",\"\",VLOOKUP(AG34,Group,7,FALSE))","v":""},null,"X"]
[null,null,null,null,null,null,null,null,null,null,null,null,null,null,null,null,null,null,null,null,null,null,null,null,null,null,null,null,null,null,null,null,null,null,null,null,null,null,null,null,null,"X"]
[null,null,"KurbIT - Low Profile Curbs",null,null,null,null,null,null,null,null,null,null,null,null,null,null,null,"Item # Lookup:","KUSHPAN",null,null,null,null,null,null,null,null,null,null,null,null,null,null,null,null,null,null,null,null,null,"X"]
[null,null,null,null,null,null,null,null,null,null,null,null,null,null,null," ",null,null,null,null,null,null,null,null,null,null,null,null,null,null,null,null,null,null,null,null,null,null,null,null,null,"X"]
[null,"Non-Stock Pans",null,null,"24\"",null,"KurbIT-24",null,null,"Shower Curb + 2 spacers",null,null,null,null,null,null,null,null,null,{"$f":"IF(Suggested=\"Yes\",AB38,AH38)","v":22.35},"EA",{"$f":"+Instructions!$B$3","v":"N"},null,{"$f":"+Instructions!$C$22","v":0},{"$f":"ROUND($AB38*(1-X38)+0.004999,2)","v":22.35},null,"",22.35,{"$f":"+X38","v":0},{"$f":"+Y38","v":22.35},{"$f":"(AH38-AD38)/AH38","v":0},null,2,{"$f":"SUM(AK38:AM38)+AF38","v":22.35},null,null,{"$f":"ROUND(AD38/(1-VLOOKUP(AG38,Group,2,FALSE)),2)","v":22.35},{"$f":"IF(VLOOKUP(AG38,Group,5,FALSE)=\"YES\",VLOOKUP(ROUND(ROUND(AK38,1)-AK38,2),Round,2,FALSE)+VLOOKUP(AG38,Group,6,FALSE),0)","v":0},{"$f":"IF(VLOOKUP(AG38,Group,7,FALSE)=\"\",0,ROUND(AK38-0.04999,1)-AK38+AN38)","v":0},{"$f":"IF(VLOOKUP(AG38,Group,7,FALSE)=\"\",\"\",VLOOKUP(AG38,Group,7,FALSE))","v":""},null,"X"]
[null,"Non-Stock Pans",null,null,"36\"",null,"KurbIT-36",null,null,"Shower Curb + 2 spacers",null,null,null,null,null,null,null,null,null,34.049999999999997,"EA",{"$f":"+Instructions!$B$3","v":"N"},null,{"$f":"+Instructions!$C$22","v":0},34.049999999999997,null,"",34.049999999999997,0,34.049999999999997,0,null,2,34.049999999999997,null,null,34.049999999999997,0,0,"",null,"X"]
[null,"Stocked Pans",null,null,"36\" Kit",null,"KurbIT-36-COV",null,null,"36\" Shower Curb w/ 2 SeeLIT Covers + 2 spacers",null,null,null,null,null,null,null,"Stock","a",63.15,"EA",{"$f":"+Instructions!$B$3","v":"N"},null,{"$f":"+Instructions!$C$22","v":0},63.15,null,"",63.15,0,63.15,0,null,1,63.15,null,null,63.15,0,0,"",null,"X"]
{"$rows_left_out":142}
{"sheet":"Websites","index":3,"n_rows":8,"n_cols":2,"rows_kept":8,"cut":false,"hidden":false,"merged":[]}
["Easy Access Website links"]
[]
["ConestogaTile's Website","www.conestogatile.com"]
[]
["Manufacturer's Home Page","https://kurbx.com/"]
[]
[]
["Product","Direct Website Link"]

{"sheet":"Changes","index":4,"n_rows":19,"n_cols":3,"rows_kept":19,"cut":false,"hidden":false,"merged":[]}
["Date"]
["Announced","Series","Description"]
[]
["New Products"]
["2025-10-21","KurbX - 4\" Square Drain Assemblies","Bar Pattern and Lattice Pattern Frameless Drains added as well as a Lattice Pattern Shelf."]
["2025-10-21","SeeLIT - Waterproofing Accessories","SeeLIT-JT-25, 25' x 6\" Joint Tape and SeeLIT-JT-75, 75' x 6\" Joint Tape added. "]
[]
[]
[]
[" "]
[]
["Discontinued Products"]
["2025-10-21","KurbIT - Low Profile Curbs","SeeLIT-COVERS, SeeLIT Curb Covers (Right-handed + Left-handed)"]
["2025-10-21","SeeLIT - Waterproofing Accessories","SeeLIT-JT-27, 27' Joint Tape and SeeLIT-JT-82, 82' Joint Tape only. "]
["2025-10-21","KurbX - 4\" Square Drain Assemblies","Grid Pattern Design 4\" Square Drain Assemblies in all colors."]
[]
[]
[]
["Changes"]