{"text_format":"1","workbook":"xlsx","n_sheets":5,"sheets":["Instructions","Index","Price List","Websites","Changes"],"not_rendered":{"charts":0,"images":3,"macros":1,"external_links":0,"defined_names":18,"comments":0,"pivot_tables":0},"unopened":[],"bounds":{"document_bytes":16777216,"sheet_cells":100000,"rows_first":2000,"rows_last":500,"rows_between":2000,"halvings":0,"cell_chars":16384,"cell_head_chars":4096},"cells_cut":0,"cells_raw":0,"read":"whole","date_system":"1900"}

{"sheet":"Instructions","index":0,"n_rows":58,"n_cols":9,"rows_kept":58,"cut":false,"hidden":false,"merged":[[7,2,7,7],[36,3,36,4]]}
["Manufacturer","Bati Orient"]
["File as","B"]
["Product Code","A"]
["CCTD Effective Date","1/1/25 (Updated)"]
[]
[]
[]
["Enter your Company Name"]
[]
[null,"Click on \"Index\" to set the print area for the price list index"]
[null,"Then you can send it to print"]
[]
[]
[null,"Click on \"Suggested Price List\" to set the print area for Conestoga Tile's suggested price list."]
[null,"Then you can send it to print"]
[]
[]
[null,"Enter your discount codes if you want a personal net cost sheet."]
[]
[null,"Product"]
[null,"Code","Disc. %"]
[null,{"$f":"+B3","v":"A"}]
[]
[null,"Click on \"Your Cost\" to set the print area for your personal cost report."]
[null,"Then you can send it to print"]
[]
[]
["Discount: ","To help establish your price list, enter the gross profit percent for each type of product."]
[null,"If you want to use Conestoga Tile's list price, leave them blank."]
[]
["Round Nickel: ","If you always want your price to round to the nearest nickel, enter \"YES\"."]
[null,"If you enter \"NO\", it will NOT round to the nearest nickel."]
[]
["Ending Cents: ","If you always want your price to end with a certain cents, enter that cent value."]
[null,"If you leave it \"blank\" will NOT round to this cent value."]
[]
[null,"Group","GP Margin","GP Margin % for",null,"Round Nickel","add/subtract","Ending Cents"]
[null,1,null,"Field Tile",null,"No",0]
[null,2,null,"Trim",null,"No",0,null,"  "]
[null,3,null,"Decos",null,"No",0]
{"$rows_left_out":19}
{"sheet":"Index","index":1,"n_rows":51,"n_cols":16,"rows_kept":51,"cut":false,"hidden":false,"merged":[[5,0,5,10],[48,0,48,10],[50,0,50,10],[2,5,2,10],[3,4,3,7]]}
[]
[]
[null,null,null,null,null,{"$f":"\"File '\"&Instructions!B2&\"' - \"&Instructions!B1","v":"File 'B' - Bati Orient"}]
[]
[]
[{"$f":"\"Price List Index - \"&Instructions!B4","v":"Price List Index - 1/1/25 (Updated)"}]
[]
[]
[]
[]
["Page",null,"Series",null,"Product Type"]
[1,null,"Décor & Style",null,"ARNO01 - ECO12"]
[2,null,"Décor & Style",null,"ECO13 - GAMI63R/30"]
[3,null,"Décor & Style",null,"GAMI74 - MAGR47"]
[4,null,"Décor & Style",null,"MAGR88 - MAMI185"]
[5,null,"Décor & Style",null,"MAMI186 - PIMI27"]
[6,null,"Décor & Style",null,"PIMI28 - VEMI170"]
[7,null,"Décor & Style",null,"VENO02 - VEVI02"]
[7,null,"Cement Tiles",null,"CIBE01 - CIMI09"]
[8,null,"Cement Tiles",null,"CIMI13 - CIMI48"]
[]
[]
[]
[]
[]
[]
[]
[]
[]
[]
[]
[]
[null,null,null,null,null,null,null,null,null,null,null,null,null,null,null," "]
[]
[]
[]
[]
[]
[]
[]
{"$rows_left_out":12}
{"sheet":"Price List","index":2,"n_rows":578,"n_cols":41,"rows_kept":578,"cut":false,"hidden":false,"merged":[[13,30,13,32],[9,22,9,23],[9,25,9,32],[12,22,12,23],[567,3,567,4],[18,2,18,19],[17,14,17,15],[561,2,561,19],[12,14,12,19],[551,3,551,19],[559,3,559,19],[9,14,9,19],[563,2,563,19],[14,13,15,19],[10,14,10,15],[557,3,557,19],[553,3,553,19],[555,3,555,19]]}
[null,"Field Tile",null,null,"Size",null,"Field",null,null,null,null,null,null,null,null,"SF/CTN",null,null,{"$f":"IF(Suggested=\"Yes\",AA1,AG1)","v":0},"SF",{"$f":"+Instructions!$B$3","v":"A"},null,{"$f":"+Instructions!$C$22","v":0},{"$f":"ROUND($AA1*(1-W1)+0.004999,2)","v":0},null,"new",0,{"$f":"+W1","v":0},0,{"$f":"(AG1-AC1)/AG1","v":{"$error":"#DIV/0!"}},null,1,{"$f":"SUM(AJ1:AL1)+AE1","v":0},null,null,{"$f":"ROUND(AC1/(1-VLOOKUP(AF1,Group,2,FALSE)),2)","v":0},{"$f":"IF(VLOOKUP(AF1,Group,5,FALSE)=\"YES\",VLOOKUP(ROUND(ROUND(AJ1,1)-AJ1,2),Round,2,FALSE)+VLOOKUP(AF1,Group,6,FALSE),0)","v":0},{"$f":"IF(VLOOKUP(AF1,Group,7,FALSE)=\"\",0,ROUND(AJ1-0.04999,1)-AJ1+AM1)","v":0},{"$f":"IF(VLOOKUP(AF1,Group,7,FALSE)=\"\",\"\",VLOOKUP(AF1,Group,7,FALSE))","v":""},null,"X"]
[null,"Trim",null,null,"Size",null,"Shape",null,"Description",null,null,null,null,null,null,null,null,null,{"$f":"IF(Suggested=\"Yes\",AA2,AG2)","v":0},"EA",{"$f":"+Instructions!$B$3","v":"A"},null,{"$f":"+Instructions!$C$22","v":0},0,null,"new",0,0,0,{"$error":"#DIV/0!"},null,2,0,null,null,0,0,0,"",null,"X"]
[null,"Decos",null,null,"Size",null,"Shape",null,"Description",null,null,null,null,null,null,null,null,null,0.05,"EA",{"$f":"+Instructions!$B$3","v":"A"},null,{"$f":"+Instructions!$C$22","v":0},0.05,null,"new",0.05,0,0.05,0,null,3,0.05,null,null,0.05,0,0,"",null,"X"]
[null,0,null,null,"Size",null,"Shape",null,"Description",null,null,null,null,null,null,null,null,null,0,"EA",{"$f":"+Instructions!$B$3","v":"A"},null,{"$f":"+Instructions!$C$22","v":0},0,null,"new",0,0,0,{"$error":"#DIV/0!"},null,4,0,null,null,0,0,0,"",null,"X"]
[null,0,null,null,"Size",null,"Shape",null,"Description",null,null,null,null,null,null,null,null,null,0,"EA",{"$f":"+Instructions!$B$3","v":"A"},null,{"$f":"+Instructions!$C$22","v":0},0,null,"new",0,0,0,{"$error":"#DIV/0!"},null,5,0,null,null,0,0,0,"",null,"X"]
[null,0,null,null,"Size",null,"Shape",null,"Description",null,null,null,null,null,null,null,null,null,0,"EA",{"$f":"+Instructions!$B$3","v":"A"},null,{"$f":"+Instructions!$C$22","v":0},0,null,"new",0,0,0,{"$error":"#DIV/0!"},null,6,0,null,null,0,0,0,"",null,"X"]
[null,0,null,null,"Size",null,"Shape",null,"Description",null,null,null,null,null,null,null,null,null,0,"EA",{"$f":"+Instructions!$B$3","v":"A"},null,{"$f":"+Instructions!$C$22","v":0},0,null,"new",0,0,0,{"$error":"#DIV/0!"},null,7,0,null,null,0,0,0,"",null,"X"]
[null,"Format",null,null,null,null,null,null,null,null,null,null,null,null,null,null,"Stock","a",1000,"ABC",null,null,0.1,1000,null,"ABC",1000,0.1,1000,0.1,10,null,1000,null,null,null,null,null,null,null,"X"]
[null,null,null,null,null,null,null,null,null,null,null,null,null,null,null,null,null,null,null,null,null,null,null,null,null,null,null,null,null,null,null,null,null,null,null,null,null,null,null,null,"X"]
[null,null,null,null,null,null,null,null,null,null,null,null,null,null,"Price List",null,null,null,null,null,null,null,"Cust. Cost",null,null,"Customer Cost Calculation",null,null,null,null,null,null,null,null,null,null,null,null,null,null,"X"]
[null,null,null,"Sizes & Shapes",null,null,null,null,null,null,null,null,null,null,"Full Carton",null,"Stock","Note",{"$f":"IF(Suggested=\"Yes\",AA11,AG11)","v":"List Price"},"U/M","Code",null,"Disc.","Net",null,"Chg","List Price","Disc","Act. Cost","GP%","Adj.","Group","Price",null,null,"Calc Price",".05 Round","Cents","Round to",null,"X"]
[null,null,null,null,null,null,null,null,null,null,null,null,null,null,null,null,null,null,null,null,null,null,null,null,null,null,null,null,null,null,null,null,null,null,null,null,null,null,null,null,"X"]
[null,null,null,null,null,null,null,null,null,null,null,null,null,null,{"$f":"\"File '\"&Instructions!B2&\"' - \"&Instructions!B1","v":"File 'B' - Bati Orient"},null,null,null,null,null,null,null,"Cost",null,null,null,null,null,null,null,null,null,"Retail Price Calculations",null,null,null,null,null,null,null,"X"]
[null,null,null,null,null,null,null,null,null,null,null,null,null,null,null,null,null,null,null,{"$f":"+Instructions!B4","v":"1/1/25 (Updated)"},null,null,null,null,null,null,null,null,null,null,{"$f":"TODAY()","v":"2025-04-30"},null,null,null,null,null,null,null,null,null,"X"]
[null,null,null,null,null,null,null,null,null,null,null,null,null,{"$f":"IF(Instructions!C8=\"\",\"\",+Instructions!C8)","v":""},null,null,null,null,null,null,null,null,null,null,null,null,null,null,null,null,null,null,null,null,null,null,null,null,null,null,"X"]
[null,null,{"$f":"\"Product Code '\"&Instructions!B3&\"'\"","v":"Product Code 'A'"},null,null,null,null,null,null,null,null,null,null,null,null,null,null,null,null,null,null,null,null,null,null,null,null,null,null,null,null,null,{"$f":"IF(Instructions!$C$8=\"\",\"\",Instructions!$C$8)","v":""},null,null,null,null,null,null,null,"X"]
[null,null,null,null,null,null,null,null,null,null,null,null,null,null,null,null,null,null,null,null,null,null,null,null,null,null,null,null,null,null,null,null,null,null,null,null,null,null,null,null,"X"]
[null,null,"Sizes & Shapes",null,null,null,null,null,null,null,null,null,null,null,"Full Carton",null,"Stock","Note",{"$f":"+S$11","v":"List Price"},"U/M",{"$f":"+U$11","v":"Code"},null,"Disc.","Net",null,"Chg","List Price",{"$f":"+AB$11","v":"Disc"},"Act. Cost","GP%","Adj.",{"$f":"+AF$11","v":"Group"},"Price",null,null,"Calc Price",".05 Round","Cents","Round to",null,"X"]
[null,null,"ALL ITEMS MARKED WITH PACKAGING QUANTITY ARE SOLD IN MULTIPLES OF THAT QUANTITY ONLY",null,null,null,null,null,null,null,null,null,null,null,null,null,null,null,null,null,null,null,null,null,null,null,null,null,null,null,null,null,null,null,null,null,null,null,null,null,"X"]
[null,null,null,null,null,null,null,null,null,null,null,null," ",null,null,null,null,null,null,null,null,null,null,null,null,null,null,null,null,null,null,null,null,null,null,null,null,null,null,null,"X"]
[null,null,"DÉCOR & STYLE",null,null,null,null,null,null,null,null," ","  "," "," ",null,null,"Item # Lookup:","BO"]
[null,null,null,null,null,null,null,null,null,null,null,null,null,null," ",null,null,null,null,null,null,null,null,null,null,null,null,null,null,null,null,null,null,null,null,null,null,null,null,null,"X"]
[9.75,"Decos",null,null,"12\" x 12\"",null,"Mosaic",null,null,"ARNO01",null,"Black Slate 1\" x 1\"",null,null," "," ",null,null,{"$f":"IF(Suggested=\"Yes\",AA23,AG23)","v":52.5},"EA",{"$f":"+Instructions!$B$3","v":"A"},null,{"$f":"+Instructions!$C$22","v":0},{"$f":"ROUND($AA23*(1-W23)+0.004999,2)","v":52.5},null,"",52.5,{"$f":"+W23","v":0},52.5,{"$f":"(AG23-AC23)/AG23","v":0},null,3,{"$f":"SUM(AJ23:AL23)+AE23","v":52.5},null,null,{"$f":"ROUND(AC23/(1-VLOOKUP(AF23,Group,2,FALSE)),2)","v":52.5},{"$f":"IF(VLOOKUP(AF23,Group,5,FALSE)=\"YES\",VLOOKUP(ROUND(ROUND(AJ23,1)-AJ23,2),Round,2,FALSE)+VLOOKUP(AF23,Group,6,FALSE),0)","v":0},{"$f":"IF(VLOOKUP(AF23,Group,7,FALSE)=\"\",0,ROUND(AJ23-0.04999,1)-AJ23+AM23)","v":0},{"$f":"IF(VLOOKUP(AF23,Group,7,FALSE)=\"\",\"\",VLOOKUP(AF23,Group,7,FALSE))","v":""},null,"X"]
[null,"Decos",null,null,"12\" x 12\"",null,"Mosaic",null,null,"ARNO02",null,"Black Slate 3/4\" x 1-5/8\" Brick",null,null,null,null,null,null,52.5,"EA",{"$f":"+Instructions!$B$3","v":"A"},null,{"$f":"+Instructions!$C$22","v":0},52.5,null,"",52.5,0,52.5,0,null,3,52.5,null,null,52.5,0,0,"",null,"X"]
[null,"Decos",null,null,"4-3/4\" x 12\"",null,"Border",null,null,"ARNO03",null,"Black Slate",null,null," ",null,null,null,33.5,"EA",{"$f":"+Instructions!$B$3","v":"A"},null,{"$f":"+Instructions!$C$22","v":0},33.5,null,"",33.5,0,33.5,0,null,3,33.5,null,null,33.5,0,0,"",null,"X"]
[null,"Decos",null,null,"6\" x 12\" x 1/2\"",null,"Mosaic",null,null,"ARNO14",null,"Grey Wall Slate",null,null,null,null,null,null,25.15,"EA",{"$f":"+Instructions!$B$3","v":"A"},null,{"$f":"+Instructions!$C$22","v":0},25.15,null,"",25.15,0,25.15,0,null,3,25.15,null,null,25.15,0,0,"",null,"X"]
[null,"Decos",null,null,"4\" x 14\"",null,"Wall Cladding",null,null,"ARNO20",null,"Black Slate",null,null,null,"12 PCS/CTN",null,null,20.25,"EA",{"$f":"+Instructions!$B$3","v":"A"},null,{"$f":"+Instructions!$C$22","v":0},20.25,null,"",20.25,{"$f":"+W27","v":0},20.25,0,null,3,20.25,null,null,20.25,0,0,"",null,"X"]
[null,"Decos",null,null,"12\" x 12\"",null,"Mosaic",null,null,"ARNO22",null,"Black Slate Baguette Squares",null,null,null,null,null,null,34.950000000000003,"EA",{"$f":"+Instructions!$B$3","v":"A"},null,{"$f":"+Instructions!$C$22","v":0},34.950000000000003,null,"",34.950000000000003,0,34.950000000000003,0,null,3,34.950000000000003,null,null,34.950000000000003,0,0,"",null,"X"]
[null,"Decos",null,null,"12\" x 12\"",null,"Mosaic",null,null,"ARRO01",null,"Rust Slate 1\" x 1\"",null,null,null,null,null,null,57.3,"EA",{"$f":"+Instructions!$B$3","v":"A"},null,{"$f":"+Instructions!$C$22","v":0},57.3,null,"",57.3,{"$f":"+W29","v":0},57.3,0,null,3,57.3,null,null,57.3,0,0,"",null,"X"]
[null,"Decos",null,null,"12\" x 12\"",null,"Mosaic",null,null,"ARRO02",null,"Rust Slate 3/4\" x 1-5/8\"",null,null,null,null,null,null,57.3,"EA",{"$f":"+Instructions!$B$3","v":"A"},null,{"$f":"+Instructions!$C$22","v":0},57.3,null,"",57.3,0,57.3,0,null,3,57.3,null,null,57.3,0,0,"",null,"X"]
[null,"Decos"," ",null,"4-3/4\" x 12\"",null,"Border",null,null,"ARRO03",null,"Rust Slate",null,null,null,null,null,null,34,"EA",{"$f":"+Instructions!$B$3","v":"A"},null,{"$f":"+Instructions!$C$22","v":0},34,null,"",34,0,34,0,null,3,34,null,null,34,0,0,"",null,"X"]
[null,"Decos",null,null,"12\" x 11.6\"",null,"Mosaic",null,null,"ARRO16",null,"Beige/Brown Slate/Glass Baguette",null,null,null,null,null,null,88.75,"EA",{"$f":"+Instructions!$B$3","v":"A"},null,{"$f":"+Instructions!$C$22","v":0},88.75,null,"",88.75,0,88.75,0,null,3,88.75,null,null,88.75,0,0,"",null,"X"]
[null,"Decos",null,null,"12\" x 12\"",null,"Mosaic",null,null,"ARRO17",null,"Brown Slate/Beige Brown Glass Glossy 5/8\" x 5/8\"",null,null,null,null,null,"a",88.7,"EA",{"$f":"+Instructions!$B$3","v":"A"},null,{"$f":"+Instructions!$C$22","v":0},88.7,null,"",88.7,0,88.7,0,null,3,88.7,null,null,88.7,0,0,"",null,"X"]
[null,"Decos",null,null,"4\" x 14\"",null,"Wall Cladding",null,null,"ARRO19",null,"Rust Slate",null,null,null,"12 PCS/CTN",null,null,21.25,"EA",{"$f":"+Instructions!$B$3","v":"A"},null,{"$f":"+Instructions!$C$22","v":0},21.25,null,"",21.25,{"$f":"+W34","v":0},21.25,0,null,3,21.25,null,null,21.25,0,0,"",null,"X"]
[null,"Decos",null,null,"12.2\" x 12.2\"",null,"Mosaic",null,null,"BEGR03",null,"Grey Concrete Circle Mix",null,null,null,null,null,null,{"$f":"IF(Suggested=\"Yes\",AA35,AG35)","v":57.8},"EA",{"$f":"+Instructions!$B$3","v":"A"},null,{"$f":"+Instructions!$C$22","v":0},{"$f":"ROUND($AA35*(1-W35)+0.004999,2)","v":57.8},null,"new",57.8,{"$f":"+W35","v":0},{"$f":"+X35","v":57.8},{"$f":"(AG35-AC35)/AG35","v":0},null,3,{"$f":"SUM(AJ35:AL35)+AE35","v":57.8},null,null,{"$f":"ROUND(AC35/(1-VLOOKUP(AF35,Group,2,FALSE)),2)","v":57.8},{"$f":"IF(VLOOKUP(AF35,Group,5,FALSE)=\"YES\",VLOOKUP(ROUND(ROUND(AJ35,1)-AJ35,2),Round,2,FALSE)+VLOOKUP(AF35,Group,6,FALSE),0)","v":0},{"$f":"IF(VLOOKUP(AF35,Group,7,FALSE)=\"\",0,ROUND(AJ35-0.04999,1)-AJ35+AM35)","v":0},{"$f":"IF(VLOOKUP(AF35,Group,7,FALSE)=\"\",\"\",VLOOKUP(AF35,Group,7,FALSE))","v":""},null,"X"]
[null,"Decos",null,null,"11.7\" x 11.7\"",null,"Mosaic",null,null,"BEGR04",null,"Grey Concrete Multi Star Mix",null,null,null,null,null,null,57.8,"EA",{"$f":"+Instructions!$B$3","v":"A"},null,{"$f":"+Instructions!$C$22","v":0},57.8,null,"new",57.8,0,57.8,0,null,3,57.8,null,null,57.8,0,0,"",null,"X"]
[null,"Decos",null,null,"12\" x 12\"",null,"Mosaic",null,null,"BEMI13",null,"Red White Square Mix",null,null,null,null,null,null,57.8,"EA",{"$f":"+Instructions!$B$3","v":"A"},null,{"$f":"+Instructions!$C$22","v":0},57.8,null,"new",57.8,0,57.8,0,null,3,57.8,null,null,57.8,0,0,"",null,"X"]
[null,"Decos",null,null,"12\" x 12\"",null,"Mosaic",null,null,"BEMI14",null,"Grey Mix Square Mix",null,null,null,null,null,null,{"$f":"IF(Suggested=\"Yes\",AA38,AG38)","v":57.8},"EA",{"$f":"+Instructions!$B$3","v":"A"},null,{"$f":"+Instructions!$C$22","v":0},{"$f":"ROUND($AA38*(1-W38)+0.004999,2)","v":57.8},null,"new",57.8,{"$f":"+W38","v":0},{"$f":"+X38","v":57.8},{"$f":"(AG38-AC38)/AG38","v":0},null,3,{"$f":"SUM(AJ38:AL38)+AE38","v":57.8},null,null,{"$f":"ROUND(AC38/(1-VLOOKUP(AF38,Group,2,FALSE)),2)","v":57.8},{"$f":"IF(VLOOKUP(AF38,Group,5,FALSE)=\"YES\",VLOOKUP(ROUND(ROUND(AJ38,1)-AJ38,2),Round,2,FALSE)+VLOOKUP(AF38,Group,6,FALSE),0)","v":0},{"$f":"IF(VLOOKUP(AF38,Group,7,FALSE)=\"\",0,ROUND(AJ38-0.04999,1)-AJ38+AM38)","v":0},{"$f":"IF(VLOOKUP(AF38,Group,7,FALSE)=\"\",\"\",VLOOKUP(AF38,Group,7,FALSE))","v":""},null,"X"]
[null,"Decos",null,null,"12.2\" x 12.2\"",null,"Mosaic",null,null,"BERO01",null,"Red Concrete Circle Mix",null,null,null,null,null,null,{"$f":"IF(Suggested=\"Yes\",AA39,AG39)","v":57.8},"EA",{"$f":"+Instructions!$B$3","v":"A"},null,{"$f":"+Instructions!$C$22","v":0},{"$f":"ROUND($AA39*(1-W39)+0.004999,2)","v":57.8},null,"new",57.8,{"$f":"+W39","v":0},{"$f":"+X39","v":57.8},{"$f":"(AG39-AC39)/AG39","v":0},null,3,{"$f":"SUM(AJ39:AL39)+AE39","v":57.8},null,null,{"$f":"ROUND(AC39/(1-VLOOKUP(AF39,Group,2,FALSE)),2)","v":57.8},{"$f":"IF(VLOOKUP(AF39,Group,5,FALSE)=\"YES\",VLOOKUP(ROUND(ROUND(AJ39,1)-AJ39,2),Round,2,FALSE)+VLOOKUP(AF39,Group,6,FALSE),0)","v":0},{"$f":"IF(VLOOKUP(AF39,Group,7,FALSE)=\"\",0,ROUND(AJ39-0.04999,1)-AJ39+AM39)","v":0},{"$f":"IF(VLOOKUP(AF39,Group,7,FALSE)=\"\",\"\",VLOOKUP(AF39,Group,7,FALSE))","v":""},null,"X"]
[null,"Decos",null,null,"11.7\" x 11.7\"",null,"Mosaic",null,null,"BERO02",null,"Red Concrete Multi Star Mix",null,null,null,null,null,null,{"$f":"IF(Suggested=\"Yes\",AA40,AG40)","v":57.8},"EA",{"$f":"+Instructions!$B$3","v":"A"},null,{"$f":"+Instructions!$C$22","v":0},{"$f":"ROUND($AA40*(1-W40)+0.004999,2)","v":57.8},null,"new",57.8,{"$f":"+W40","v":0},{"$f":"+X40","v":57.8},{"$f":"(AG40-AC40)/AG40","v":0},null,3,{"$f":"SUM(AJ40:AL40)+AE40","v":57.8},null,null,{"$f":"ROUND(AC40/(1-VLOOKUP(AF40,Group,2,FALSE)),2)","v":57.8},{"$f":"IF(VLOOKUP(AF40,Group,5,FALSE)=\"YES\",VLOOKUP(ROUND(ROUND(AJ40,1)-AJ40,2),Round,2,FALSE)+VLOOKUP(AF40,Group,6,FALSE),0)","v":0},{"$f":"IF(VLOOKUP(AF40,Group,7,FALSE)=\"\",0,ROUND(AJ40-0.04999,1)-AJ40+AM40)","v":0},{"$f":"IF(VLOOKUP(AF40,Group,7,FALSE)=\"\",\"\",VLOOKUP(AF40,Group,7,FALSE))","v":""},null,"X"]
{"$rows_left_out":539}
{"sheet":"Websites","index":3,"n_rows":8,"n_cols":2,"rows_kept":8,"cut":false,"hidden":false,"merged":[]}
["Easy Access Website links"]
[]
["ConestogaTile's Website","http://www.conestogatile.com/"]
[]
["Manufacturer's Home Page","https://www.batiorientusa.com/en/home"]
[]
[]
["Product","Direct Website Link"]

{"sheet":"Changes","index":4,"n_rows":626,"n_cols":15,"rows_kept":626,"cut":false,"hidden":false,"merged":[]}
["Date Announced","Series"]
[]
["New Products"]
[]
["2013-04-01","Decorative Mosaics"]
["2013-04-01","Marble"]
["2013-04-01","Pebbles"]
["2013-04-01","Quartzite / Slate"]
["2013-05-28","Decorative Mosaics"]
["2013-05-28","Marble"]
["2013-05-28","Marble"]
["2013-05-28","Pebbles"]
["2013-05-28","Quartzite / Slate"]
["2013-05-28","Quartzite / Slate"]
["2014-08-12","ARRO16 - Slate / Beige & Brown Glass 12\" x 11.6\" Mosaic"]
["      \"","ARRO17 - Slate / Beige & Brown Glass 12\" x 12\" Mosaic"]
["      \"","MABL75/30 - White 5-1/2\" x 12\" Border"]
["      \"","MACA02/30 - Cappuccino 5-1/2\" x 12\" Border"]
["      \"","MACA03 - Cappuccino 11.6\" x 12\" Mosaic"]
["      \"","MAGR89/30 - Grey 5-1/2\" x 12\" Border"]
["      \"","MAGR92 - Dark Grey 11.6\" x 12\" Mosaic"]
["      \"","MAMI92 - Marble / Beige & Brown Glass 12\" x 12\" Mosaic"]
["      \"","MAMI93 - Marble / Beige & Brown Glass 12\" x 12\" Mosaic"]
["      \"","MAMI94 - Marble / Black, Grey & White Glass 12\" x 12\" Mosaic"]
["      \"","MAMI95 - Marble / Black, Grey & White Glass 12\" x 12\" Mosaic"]
["      \"","MAMI96/30 - White / Grey / Dark Grey 5-1/2\" x 12\" Border"]
["      \"","MAMI101 - Black 12\" x 12\" Mosaic",null,null,null,null," "]
["      \"","MAMI102 - Black 4\" x 12\" Border"]
["      \"","MAMI103 - Beige 12\" x 12\" Mosaic"]
["      \"","MAMI104 - Beige 4\" x 12\" Border"]
["      \"","MAMI119 - Beige / Shell Brown 11.6\" x 12\" Mosaic"]
["      \"","MAMI120 - Beige / White / Shell Beige 11.6\" x 12\" Mosaic"]
["      \"","MAMI123 - Cappuccino / Onyx Cream 11.6\" x 12\" Mosaic"]
["      \"","PIMI19 - White / Grey / Silver 4\" x 12\" Border"]
["      \"","PIMI21 - Taupe / Gold 4\" x 12\" Border"]
["      \"","PIMI23 - White / Grey / Red 4\" x 12\" Border"]
["      \"","PIMI24 - Zebra 2\" x 2\" White / Black Décor 12\" x 12\" Mosaic"]
["      \"","QUMI17 - Grey / Beige Glass / Quartzite / Metal 12\" x 12\" Mosaic"]
["      \"","VEMI65 - Blue / Light Blue / White 3\" x 7.9\" Border "]
["      \"","VEMI66 - Black / Grey / White 3\" x 7.9\" Border  "]
{"$rows_left_out":586}