{"text_format":"1","workbook":"xlsx","n_sheets":5,"sheets":["Instructions","Index","Price List","Websites","Changes"],"not_rendered":{"charts":0,"images":1,"macros":1,"external_links":0,"defined_names":19,"comments":0,"pivot_tables":0},"unopened":[],"bounds":{"document_bytes":16777216,"sheet_cells":100000,"rows_first":2000,"rows_last":500,"rows_between":2000,"halvings":0,"cell_chars":16384,"cell_head_chars":4096},"cells_cut":0,"cells_raw":0,"read":"whole","date_system":"1900"}

{"sheet":"Instructions","index":0,"n_rows":55,"n_cols":9,"rows_kept":55,"cut":false,"hidden":false,"merged":[[8,2,8,7],[31,3,31,4]]}
["Manufacturer","ConestogaLVT"]
["File as","C"]
["Product Code","L"]
["CCTD Effective Date","1/1/24 (Updated)"]
["Enter \"MKTG\" in discount for Customers who have invested in a display.  For Others enter '0%\"",null,null,null,null,null,null,null,"MKTG"]
[]
[]
[]
["Enter your Company Name"]
[]
[null,"Click on \"Index\" to set the print area for the price list index"]
[null,"Then you can send it to print"]
[]
[]
[null,"Product Code","All LVT","Setting Materials","Care & Maint."]
[null,null,"Displayed","Stock Disc %","Stock Disc %"]
[null,{"$f":"+B3","v":"L"},0,0,0]
[]
[null,"Click on \"Your Cost\" to set the print area for your personal cost report."]
[null,"Then you can send it to print"]
[]
[]
["Discount: ","To help establish your price list, enter the gross profit percent for each type of product."]
[null,"If you want to use Conestoga Tile's list price, leave them blank."]
[]
["Round Nickel: ","If you always want your price to round to the nearest nickel, enter \"YES\"."]
[null,"If you enter \"NO\", it will NOT round to the nearest nickel."]
[]
["Ending Cents: ","If you always want your price to end with a certain cents, enter that cent value."]
[null,"If you leave it \"blank\" will NOT round to this cent value."]
[]
[null,"Group","GP Margin","GP Margin % for",null,"Round Nickel","add/subtract","Ending Cents"]
[null,1,null,"Glue-Down",null,"Yes",0]
[null,2,null,"Rigid Core",null,"Yes",0]
[null,3,null,"Loose Lay",null,"Yes",0]
[null,4,null,null,null,"Yes",0]
[null,5,null,"Design Strips",null,"Yes",0]
[null,6,null,"Care & Maintenance",null,"Yes",0]
[null,7,null,"Setting Material",null,"Yes",0]
[null,8,null,null,null,"Yes",0]
{"$rows_left_out":16}
{"sheet":"Index","index":1,"n_rows":51,"n_cols":11,"rows_kept":51,"cut":false,"hidden":false,"merged":[[5,0,5,10],[2,5,2,10],[48,0,48,10],[50,0,50,10]]}
[]
[]
[null,null,null,null,null,{"$f":"\"File '\"&Instructions!B2&\"' - \"&Instructions!B1","v":"File 'C' - ConestogaLVT"}]
[]
[]
[{"$f":"\"Price List Index - \"&Instructions!B4","v":"Price List Index - 1/1/24 (Updated)"}]
[]
[]
[]
[]
["Page",null,"Series",null,"Product Type",null,"Page",null,"Series",null,"Product Type"]
[]
[]
[]
[]
[]
[]
[]
[]
[]
[]
[]
[]
[]
[]
[]
[]
[]
[]
[]
[]
[]
[]
[]
[]
[]
[]
[]
[]
[]
{"$rows_left_out":12}
{"sheet":"Price List","index":2,"n_rows":206,"n_cols":44,"rows_kept":206,"cut":false,"hidden":false,"merged":[[14,29,14,31],[15,19,15,21],[191,3,191,17],[125,3,125,17],[130,3,130,17],[142,3,142,17],[158,3,158,17],[18,3,18,17]]}
[null,"A1","Glue-Down",null,null,"Size",null,"Field",null,null,null,null,null,null,null,"SF/CTN",null,null,null,0.05,"SF",0.05,null,0.05,{"$f":"+Instructions!$C$17","v":0},null,"new",{"$f":"+T1","v":0.05},{"$f":"(AF1-AB1)/AF1","v":0},null,1,{"$f":"SUM(AM1:AO1)+AD1","v":0.05},null,null,{"$f":"+AF1","v":0.05},{"$f":"+U1","v":"SF"},null,null,{"$f":"ROUND(AB1/(1-VLOOKUP(AE1,Group,2,FALSE)),2)","v":0.05},{"$f":"IF(VLOOKUP(AE1,Group,5,FALSE)=\"YES\",VLOOKUP(ROUND(ROUND(AM1,1)-AM1,2),Round,2,FALSE)+VLOOKUP(AE1,Group,6,FALSE),0)","v":0},{"$f":"IF(VLOOKUP(AE1,Group,7,FALSE)=\"\",0,ROUND(AM1-0.04999,1)-AM1+AP1)","v":0},{"$f":"IF(VLOOKUP(AE1,Group,7,FALSE)=\"\",\"\",VLOOKUP(AE1,Group,7,FALSE))","v":""},null,"X"]
[null,"A2","Rigid Core",null,null,"Size",null,"Field",null,null,null,null,null,null,null,"SF/CTN",null,null,null,0.05,"SF",0.05,null,0.05,{"$f":"+Instructions!$C$17","v":0},null,"new",0.05,{"$f":"(AF2-AB2)/AF2","v":0},null,2,{"$f":"SUM(AM2:AO2)+AD2","v":0.05},null,null,{"$f":"+AF2","v":0.05},"SF",null,null,{"$f":"ROUND(AB2/(1-VLOOKUP(AE2,Group,2,FALSE)),2)","v":0.05},{"$f":"IF(VLOOKUP(AE2,Group,5,FALSE)=\"YES\",VLOOKUP(ROUND(ROUND(AM2,1)-AM2,2),Round,2,FALSE)+VLOOKUP(AE2,Group,6,FALSE),0)","v":0},{"$f":"IF(VLOOKUP(AE2,Group,7,FALSE)=\"\",0,ROUND(AM2-0.04999,1)-AM2+AP2)","v":0},{"$f":"IF(VLOOKUP(AE2,Group,7,FALSE)=\"\",\"\",VLOOKUP(AE2,Group,7,FALSE))","v":""},null,"X"]
[null,"A3","Loose Lay",null,null,"Size",null,"Field",null,null,null,null,null,null,null,"SF/CTN",null,null,null,0.05,"SF",0.05,null,0.05,{"$f":"+Instructions!$C$17","v":0},null,"new",0.05,0,null,3,0.05,null,null,0.05,"SF",null,null,0.05,0,0,"",null,"X"]
[null,"C4","Trim",null,null,"Size",null,"Shape",null,null,null,null,null,null,null,null,null,null,null,0.05,"EA",0.05,null,0.05,{"$f":"+Instructions!$C$17","v":0},null,"new",0.05,{"$f":"(AF4-AB4)/AF4","v":0},null,4,{"$f":"SUM(AM4:AO4)+AD4","v":0.05},null,null,{"$f":"+AF4","v":0.05},"EA",null,null,{"$f":"ROUND(AB4/(1-VLOOKUP(AE4,Group,2,FALSE)),2)","v":0.05},{"$f":"IF(VLOOKUP(AE4,Group,5,FALSE)=\"YES\",VLOOKUP(ROUND(ROUND(AM4,1)-AM4,2),Round,2,FALSE)+VLOOKUP(AE4,Group,6,FALSE),0)","v":0},{"$f":"IF(VLOOKUP(AE4,Group,7,FALSE)=\"\",0,ROUND(AM4-0.04999,1)-AM4+AP4)","v":0},{"$f":"IF(VLOOKUP(AE4,Group,7,FALSE)=\"\",\"\",VLOOKUP(AE4,Group,7,FALSE))","v":""},null,"X"]
[null,"A5","Design Strip",null,null,"Size",null,"Shape",null,null,null,null,null,null,null,null,null,null,null,0.05,"EA",0,null,0.05,{"$f":"+Instructions!$C$17","v":0},null,"new",0.05,0,null,5,0.05,null,null,0.05,"EA",null,null,0.05,0,0,"",null,"X"]
[null,"A6","Care & Maintenance",null,null,"Size",null,"Shape",null,null,null,null,null,null,null,null,null,null,null,0.05,"EA",0,null,0.05,{"$f":"+Instructions!$E$17","v":0},null,"new",0.05,{"$f":"(AF6-AB6)/AF6","v":0},null,6,{"$f":"SUM(AM6:AO6)+AD6","v":0.05},null,null,{"$f":"+AF6","v":0.05},"EA",null,null,{"$f":"ROUND(AB6/(1-VLOOKUP(AE6,Group,2,FALSE)),2)","v":0.05},{"$f":"IF(VLOOKUP(AE6,Group,5,FALSE)=\"YES\",VLOOKUP(ROUND(ROUND(AM6,1)-AM6,2),Round,2,FALSE)+VLOOKUP(AE6,Group,6,FALSE),0)","v":0},{"$f":"IF(VLOOKUP(AE6,Group,7,FALSE)=\"\",0,ROUND(AM6-0.04999,1)-AM6+AP6)","v":0},{"$f":"IF(VLOOKUP(AE6,Group,7,FALSE)=\"\",\"\",VLOOKUP(AE6,Group,7,FALSE))","v":""},null,"X"]
[null,"A7","Setting Material",null,null,"Size",null,"Description",null,null,null,null,null,null,null,null,null,null,null,0.05,"EA",0,null,0.05,{"$f":"+Instructions!$D$17","v":0},null,"new",0.05,0,null,7,0.05,null,null,0.05,"EA",null,null,0.05,0,0,"",null,"X"]
[null,null,"Format",null,null,null,null,null,null,null,null,null,null,null,null,null,"Stock","a",null,1000,"ABC",1000,null,1000,0.1,null,"ABC",1000,0.1,10,null,1000,null,null,1000,null,null,null,null,null,null,null,null,"X"]
[null,null,null,null,null,null,null,null,null,null,null,null,null,null,null,null,null,null,null,null,null,null,null,null,null,null,null,null,null,null,null,null,null,null,null,null,null,null,null,null,null,null,null,"X"]
[null,null,null,null,null,null,null,null,null,null,null,null,null,null,null,null,null,null,null,null,null,null,null,null,null,null,null,null,null,null,null,null,null,null,null,null,null,null,null,null,null,null,null,"X"]
[null,null,null,"Customer Cost",null,null,null,null,null,null,null,null,null,null,null,null,null,null,null,null,null,null,null,"Cost Calc",null,null,"Customer Selling Price Calculation",null,null,null,null,null," ","Retail P/L",null,null,null,null,null,null,null,null,null,"X"]
[null,null,null,null,null,null,null,null,null,null,null,null,null,null,null,null,null,null,null,null,null,null,null,null,null,null,null,null,null,null,null,null,null,null,null,null,null,null,null,null,null,null,null,"X"]
[null,null,null,{"$f":"\"File '\"&Instructions!B2&\"' - \"&Instructions!B1","v":"File 'C' - ConestogaLVT"},null,null,null,null,null,null,null,null,null,null,null,null,null,null,null,null,null,"Cost",null,null,null,null,null,null,null,null,null,{"$f":"+$D$13","v":"File 'C' - ConestogaLVT"},null,null,null,"Price List",null,null,null,null,null,null,null,"X"]
[null,null,null,{"$f":"IF(Instructions!C9=\"\",\"\",+Instructions!C9)","v":""},null,null,null,null,null,null,null,null,null,null,null,null,null,null,null,null,null,"1/1/24 (Updated)",null,null,null,null,null,null,null,null,null,"Retail Price Calculations",null,null,null,{"$f":"+Instructions!$B$4","v":"1/1/24 (Updated)"},null,null,null,null,null,null,null,"X"]
[null,null,null,null,null,null,null,null,null,null,null,null,null,null,null,null,null,null," ",null,null,null,null,null,null,null,null,null,null,{"$f":"TODAY()","v":"2024-02-07"},null,null,null,null,null,null,null,null,null,null,null,null,null,"X"]
[null,null,null,{"$f":"\"Product Code '\"&Instructions!B3&\"'\"","v":"Product Code 'L'"},null,null,null,null,null,null,null,null,null,null,null,null,null,null,null,"Net Cost",null,null,null,null,null,null,null,null,null,null,null,{"$f":"IF(Instructions!$C$9=\"\",\"\",Instructions!$C$9)","v":""},null,null,null,null,null,null,null,null,null,null,null,"X"]
[null,null,null,null,null,null,null,null,null,null,null,null,null,null,null,null,null,null,null,null,null,null,null,null,null,null,null,null,null,null,null,null,null,null,null,null,null,null,null,null,null,null,null,"X"]
[null,null,null,"Sizes & Shapes",null,null,null,null,null,null,null,null,null,null,"Full Carton",null,"Stock","Note",null,"Net Unit","U/M",">1000 sf",null,"Unit Cost","Disc.",null,"Chg","Net Cost","GP%","Adj.","Group","Price",null,null,"List Price","U/M",null,null,"Calc Price",".05 Round","Cents","Round to",null,"X"]
[null,null,null,"ALL ITEMS MARKED WITH PACKAGING QUANTITY ARE SOLD IN MULTIPLES OF THAT QUANTITY ONLY",null,null,null,null,null,null,null,null,null,null,null,null,null,null,null,null,null,null,null,null,null,null,null,null,null,null,null,null,null,null,null,null,null,null,null,null,null,null,null,"X"]
[null,null,null,null,null,null,null,null,null,null,null,null,null,null,null,null,null,null,null,null,null,null,null,null,null,null,null,null,null,null,null,null,null,null,null,null,null,null,null,null,null,null,null,"X"]
[null,null,null,"BEL AIR - Luxury Vinyl Tiles",null,null,null,null,null,null,"Discontinued 2/6/24",null,null,null,null,"Item # Lookup:","COBE",null,null,null,null,null,null,null,null,null,null,null,null,null,null,null,null,null,null,null,null,null,null,null,null,null,null,"X"]
[null,null,null,null,null,null,null,null,null,null,null,null,null,null,null,null,null,null,null,null,null,null,null,null,null,null,null,null,null,null,null,null,null,null,null,null,null,null,null,null,null,null,null,"X"]
[null,null,null,null,"Colors:","CONT200 Brown Stone",null,null,null,"  CONT203 Granite Stone",null,null,null,null,null,null,null,null,null,null,null,null,null,null,null,null,null,null,null,null,null,null,null,null,null,null,null,null,null,null,null,null,null,"X"]
[null,null,null,null,null,"CONT202 Chalk Stone",null,null,null,"  CONT201 Misty Stone",null,null,null,"  ",null,null,null,null,null,null,null,null,null,null,null,null,null,null,null,null,null,null,null,null,null,null,null,null,null,null,null,null,null,"X"]
[null,null,null,null,null,null,null,null,null,null,null,null,null,null,null,null,null,null,null,null,null,null,null,null,null,null,null,null,null,null,null,null,null,null,null,null,null,null,null,null,null,null,null,"X"]
[null,"A1","Glue-Down",null,null,"18\" x 18\" x 2.5mm",null,"20mil",null,"Glue-Down",null,null,null,null,null,"36.00 SF/CTN","Stock",null,null,3.35,"SF",3.0199999999999996,null,3.35,{"$f":"+Instructions!$C$17","v":0},null,"",{"$f":"+T26","v":3.35},{"$f":"(AF26-AB26)/AF26","v":0},null,1,{"$f":"SUM(AM26:AO26)+AD26","v":3.35},null,null,{"$f":"+AF26","v":3.35},{"$f":"+U26","v":"SF"},null,null,{"$f":"ROUND(AB26/(1-VLOOKUP(AE26,Group,2,FALSE)),2)","v":3.35},{"$f":"IF(VLOOKUP(AE26,Group,5,FALSE)=\"YES\",VLOOKUP(ROUND(ROUND(AM26,1)-AM26,2),Round,2,FALSE)+VLOOKUP(AE26,Group,6,FALSE),0)","v":0},{"$f":"IF(VLOOKUP(AE26,Group,7,FALSE)=\"\",0,ROUND(AM26-0.04999,1)-AM26+AP26)","v":0},{"$f":"IF(VLOOKUP(AE26,Group,7,FALSE)=\"\",\"\",VLOOKUP(AE26,Group,7,FALSE))","v":""},null,"X"]
[null,null,null,null,null,null,null,null,null,null,null,null,null,null,null,null,null,null,null,null,null,null,null,null,null,null,null,null,null,null,null,null,null,null,null,null,null,null,null,null,null,null,null,"X"]
[null,null,null,"BLOOMINGDALE - Luxury Vinyl Plank",null,null,null,null,null,null,null,null,null,null,null,"Item # Lookup:","COBL",null,null,null,null,null,null,null,null,null,null,null,null,null,null,null,null,null,null,null,null,null,null,null,null,null,null,"X"]
[null,null,null,null,null,null,null,null,null,null,null,null,null,null,null,null,null,null,null,null,null,null,null,null,null,null,null,null,null,null,null,null,null,null,null,null,null,null,null,null,null,null,null,"X"]
[null,null,null,null,"Colors:","COBLANT Antique Willow          COBLENG English Toffee          COBLSED Sedona",null,null,null,null,null,null,null,null,null,null,null,null,null,null,null,null,null,null,null,null,null,null,null,null,null,null,null,null,null,null,null,null,null,null,null,null,null,"X"]
[null,null,null,null,null,null,null,null,null,null,null,null,null,null,null,null,null,null,null,null,null,null,null,null,null,null,null,null,null,null,null,null,null,null,null,null,null,null,null,null,null,null,null,"X"]
[null,"B2","Rigid Core",null,null,"9\" x 60\" x 7.0mm",null,"20mil",null,"Rigid Core - WPC",null,null,null,null,null,"33.75 SF/CTN","Stock",null,null,4,"SF",3.6,null,4,{"$f":"+Instructions!$C$17","v":0},null,"",{"$f":"+T32","v":4},{"$f":"(AF32-AB32)/AF32","v":0},null,2,{"$f":"SUM(AM32:AO32)+AD32","v":4},null,null,{"$f":"+AF32","v":4},{"$f":"+U32","v":"SF"},null,null,{"$f":"ROUND(AB32/(1-VLOOKUP(AE32,Group,2,FALSE)),2)","v":4},{"$f":"IF(VLOOKUP(AE32,Group,5,FALSE)=\"YES\",VLOOKUP(ROUND(ROUND(AM32,1)-AM32,2),Round,2,FALSE)+VLOOKUP(AE32,Group,6,FALSE),0)","v":0},{"$f":"IF(VLOOKUP(AE32,Group,7,FALSE)=\"\",0,ROUND(AM32-0.04999,1)-AM32+AP32)","v":0},{"$f":"IF(VLOOKUP(AE32,Group,7,FALSE)=\"\",\"\",VLOOKUP(AE32,Group,7,FALSE))","v":""},null,"X"]
[]
[null,null,null,"BLOSSOM HILL - Luxury Vinyl Plank",null,null,null,null,null,null,"Discontinued 2/6/24",null,null,null,null,"Item # Lookup:","COBH",null,null,null,null,null,null,null,null,null,null,null,null,null,null,null,null,null,null,null,null,null,null,null,null,null,null,"X"]
[null,null,null,null,null,null,null,null,null,null,null,null,null,null,null,null,null,null,null,null,null,null,null,null,null,null,null,null,null,null,null,null,null,null,null,null,null,null,null,null,null,null,null,"X"]
[null,null,null,null,"Colors:","CON148 Ash Oak",null,null,null,"CON123 Harvest Oak",null,null,null,"CON120 Puritan Oak",null,null,null,null,null,null,null,null,null,null,null,null,null,null,null,null,null,null,null,null,null,null,null,null,null,null,null,null,null,"X"]
[null,null,null,null,null,"CON128 Carbon Oak",null,null,null,"CON150 Midtone Oak",null,null,null,"CON145 Sandy Oak",null,null,null,null,null,null,null,null,null,null,null,null,null,null,null,null,null,null,null,null,null,null,null,null,null,null,null,null,null,"X"]
[null,null,null,null,null,"CON151 Earthy Oak",null,null,null,"CON142 Mountain Oak",null,null,null,null,null,null,null,null,null,null,null,null,null,null,null,null,null,null,null,null,null,null,null,null,null,null,null,null,null,null,null,null,null,"X"]
[null,null,null,null,null,"CON121 Grey Oak",null,null,null,"CON147 Pale Oak",null,null,null,null,null,null,null,null,null,null,null,null,null,null,null,null,null,null,null,null,null,null,null,null,null,null,null,null,null,null,null,null,null,"X"]
[null,null,null,null,null,null,null,null,null,null,null,null,null,null,null,null,null,null,null,null,null,null,null,null,null,null,null,null,null,null,null,null,null,null,null,null,null,null,null,null,null,null,null,"X"]
{"$rows_left_out":167}
{"sheet":"Websites","index":3,"n_rows":8,"n_cols":2,"rows_kept":8,"cut":false,"hidden":false,"merged":[]}
["Easy Access Website links"]
[]
["ConestogaTile's Website","www.conestogatile.com"]
[]
["Manufacturer's Home Page"]
[]
[]
["Product","Direct Website Link"]

{"sheet":"Changes","index":4,"n_rows":38,"n_cols":3,"rows_kept":38,"cut":false,"hidden":false,"merged":[]}
["Date"]
["Announced","Series","Description"]
[]
["New Products"]
["2019-07-01","Bel Air","Glue Down"]
["2019-07-01","Blossom Hill","Glue Down & Loose Lay"]
["2019-07-01","Landis Valley","Rigid Core"]
["2019-07-01","Pheasant Hill","Glue Down"]
["2020-08-01","Bellevue Park","Rigid Core - SPC"]
["2020-08-01","Bloomingdale","Rigid Core - WPC"]
["2020-08-01","Del Ray","Rigid Core - WPC"]
["2020-08-01","Federal Hill","Rigid Core - SPC"]
["2021-03-09","Blossom Hill","Rigid Core added and is available in all 10 Blossom Hill colors."]
["2023-08-14","Bloomingdale","Color COBLSED Sedona in the 9\" x 60\" x 7.0mm 20mil Rigid Core - WPC plank format added. "]
["2023-08-14","Federal Hill","Colors COFHESP Espresso and COFHHEM Hemlock in the 7\" x 48\" x 5.0mm 20mil Rigid Core - SPC plank format added. "]
["2023-08-14","Skyline Drive","Rigid Core - SPC"]
["2023-08-14","Susquehanna","Rigid Core - SPC"]
["2023-11-01","Michaux","Rigid Core"]
["2023-11-01","Patapsco","Rigid Core"]
["2023-11-01","Shenandoah","Rigid Core"]
[]
[]
["Discontinued Products"]
["2021-03-09","Landis Valley","Entire Series."]
["2022-06-01","Pheasant Hill","Colors CONBU109 Light Bamboo and CONBU110 Midtone Bamboo in the 4\" x 36\" x 2.5mm 20mil Glue-Down plank format only. "]
["2023-02-10","Bellevue Park","Entire Series."]
["2023-02-10","Bloomingdale","Colors COBLHAR Harbor Fog and COBLWHI Whispering Wheat only in the 9\" x 60\" x 7.0mm format."]
["2023-02-10","Federal Hill","Colors COFHJOS Joshua Tree and COFHRUS Rustic Slate only in the 7\" x 48\" x 6.0mm format."]
["2023-08-14","Del Ray","Color CODRTIM Timberland in the 7\" x 48\" x 7.5mm 20mil Rigid Core - WPC plank format only. "]
["2024-02-06","Bel Air","Entire Series."]
["2024-02-06","Blossom Hill","Entire Series."]
["2024-02-06","Pheasant Hill","Entire Series."]
[]
[]
[]
["Changes:"]
["2023-08-14","Del Ray","Packaging is changing from 18.91 SF/CTN to 33.09 SF/CTN as inventory with old packaging is depleted."]
["2023-08-14","Federal Hill","This item is transitioning from 6.0mm to 5.0mm in thickness as inventories of the old thickness are depleted.  Packaging of the 7\" x 48\" x 5.0mm will be 23.64 SF/CTN."]