{"text_format":"1","workbook":"xlsx","n_sheets":5,"sheets":["Instructions","Index","Price List","Websites","Updates"],"not_rendered":{"charts":0,"images":1,"macros":1,"external_links":0,"defined_names":19,"comments":0,"pivot_tables":0},"unopened":[],"bounds":{"document_bytes":16777216,"sheet_cells":100000,"rows_first":2000,"rows_last":500,"rows_between":2000,"halvings":0,"cell_chars":16384,"cell_head_chars":4096},"cells_cut":0,"cells_raw":0,"read":"whole","date_system":"1900"}

{"sheet":"Instructions","index":0,"n_rows":72,"n_cols":7,"rows_kept":72,"cut":false,"hidden":false,"merged":[[7,2,7,6]]}
["Manufacturer","Tools"]
["File as","T"]
["Product Code","N"]
["CCTD Effective Date","11/1/23"]
[]
[]
[]
["Enter your Company Name"]
[]
[null,"Click on \"Index\" to set the print area for the price list index"]
[null,"Then you can send it to print"]
[]
[]
[null,"Click on \"Suggested Price List\" to set the print area for Conestoga Tile's suggested price list."]
[null,"Then you can send it to print"]
[]
[]
[null,"Enter your discount codes if you want a personal net cost sheet."]
[]
[null,null,"Product"]
[null,null,"Code","Disc. %"]
[null,null,{"$f":"+B3","v":"N"},0,"  This is a \"NET\" price list.  0% is the discount for this spreadsheet"]
[]
[null,"Click on \"Your Cost\" to set the print area for your personal cost report."]
[null,"Then you can send it to print"]
[]
[]
["Discount: ","To help establish your price list, enter the gross profit percent for each type of product."]
[null,"If you want to use Conestoga Tile's list price, leave them blank."]
[]
["Round Nickel: ","If you always want your price to round to the nearest nickel, enter \"YES\"."]
[null,"If you enter \"NO\", it will NOT round to the nearest nickel."]
[]
["Ending Cents: ","If you always want your price to end with a certain cents, enter that cent value."]
[null,"If you leave it \"blank\" will NOT round to this cent value."]
[]
[null,"GP Margin % for","Group","GP Margin","Round Nickel","add/subtract","Ending Cents"]
[null,"Barwalt - Saws/Cutters","PR1",null,"No",0]
[null,"Barwalt - All Other","PR",null,"No",0]
[null,"DeWalt - Saws/Cutters","DW1",null,"No",0]
{"$rows_left_out":33}
{"sheet":"Index","index":1,"n_rows":50,"n_cols":9,"rows_kept":50,"cut":false,"hidden":false,"merged":[[5,0,5,10],[47,0,47,10],[49,0,49,10],[2,5,2,10],[3,4,3,7],[10,2,10,4],[10,8,10,10]]}
[]
[]
[null,null,null,null,null,{"$f":"\"File '\"&Instructions!B2&\"' - \"&Instructions!B1","v":"File 'T' - Tools"}]
[]
[]
[{"$f":"\"Price List Index - \"&Instructions!B4","v":"Price List Index - 11/1/23"}]
[]
[]
[]
[]
["Page",null,"Product Type",null,null,null,"Page",null,"Product Type"]
[]
[]
[]
[]
[]
[]
[]
[]
[]
[]
[]
[]
[]
[]
[]
[]
[]
[]
[]
[]
[]
[]
[]
[]
[]
[]
[]
[]
[]
{"$rows_left_out":11}
{"sheet":"Price List","index":2,"n_rows":531,"n_cols":41,"rows_kept":531,"cut":false,"hidden":false,"merged":[[3,22,3,23],[4,22,4,23],[3,14,3,19],[4,30,4,32],[520,3,520,4],[515,2,515,19],[8,2,8,4],[513,2,513,18],[9,2,9,18],[10,2,10,18],[8,14,8,15],[391,2,391,18],[229,18,230,18]]}
[null,{"$error":"#N/A"},null,"Our Part #",null,"Description",null,null,null,null,null,null,null,null,"Mfg.",null,null,null,{"$f":"IF(Suggested=\"Yes\",'Price List'!AA1,'Price List'!AG1)","v":{"$error":"#N/A"}},"EA",{"$f":"+Instructions!$B$3","v":"N"},null,{"$f":"+Instructions!$D$22","v":0},{"$f":"ROUND($AA1*(1-W1)+0.004999,2)","v":{"$error":"#N/A"}},null,"new",{"$error":"#N/A"},{"$f":"+W1","v":0},{"$f":"+X1","v":{"$error":"#N/A"}},{"$f":"(AG1-AC1)/AG1","v":{"$error":"#N/A"}},null,{"$f":"+A1","v":0},{"$f":"SUM(AJ1:AL1)+AE1","v":{"$error":"#N/A"}},null,null,{"$f":"ROUND(AC1/(1-VLOOKUP(AF1,Group,2,FALSE)),2)","v":{"$error":"#N/A"}},{"$f":"IF(VLOOKUP(AF1,Group,3,FALSE)=\"YES\",VLOOKUP(ROUND(ROUND(AJ1,1)-AJ1,2),Round,2,FALSE)+VLOOKUP(AF1,Group,4,FALSE),0)","v":{"$error":"#N/A"}},{"$f":"IF(VLOOKUP(AF1,Group,5,FALSE)=\"\",0,ROUND(AJ1-0.04999,1)-AJ1+AM1)","v":{"$error":"#N/A"}},{"$f":"IF(VLOOKUP(AF1,Group,5,FALSE)=\"\",\"\",VLOOKUP(AF1,Group,5,FALSE))","v":{"$error":"#N/A"}},null,"X"]
[null,"Format",null,null,null,null,null,null,null,null,null,null,null,null,null,null,"Stock","a",1000,"ABC",null,null,0.1,1000,null,"ABC",1000,0.1,1000,0.1,10,null,1000,null,null,null,null,null,null,null,"X"]
[null,null,null,null,null,null,null,null,null,null,null,null,null,null,null,null,null,null,null,null,null,null,null,null,null,null,null,null,null,null,null,null,null,null,null,null,null,null,null,null,"X"]
[null,null,null,null,null,null,null,null,null,null,null,null,null,null,{"$f":"\"File '\"&Instructions!B2&\"' - \"&Instructions!B1","v":"File 'T' - Tools"},null,null,null,null,null,null,null,null,null,null,null,null,null,null,null,null,null,"Retail Price Calculations",null,null,null,null,null,null,null,"X"]
[null,null,null,null,null,null,null,null,null,null,null,null,null,null,null,null,null,null,null,{"$f":"+Instructions!B4","v":"11/1/23"},null,null,"Cost",null,null,null,null,null,null,null,{"$f":"TODAY()","v":"2023-09-28"},null,null,null,null,null,null,null,null,null,"X"]
[null,null,{"$f":"\"Product Code '\"&Instructions!B3&\"'\"","v":"Product Code 'N'"},null,null,null,null,null,null,null,null,null,null,null,null,null,null,null,null,null,null,null,null,null,null,null,null,null,null,null,null,null,null,null,null,null,null,null,null,null,"X"]
[null,null,null,null,null,null,null,null,null,null,null,null,null,null,null,null,null,null,null,null,null,null,null,null,null,null,null,null,null,null,null,null,null,null,null,null,null,null,null,null,"X"]
[null,null,null,null,null,null,null,null,null,null,null,null,null,null,null,null,null,null,null,null,null,null,null,null,null,null,null,null,null,null,null,null,null,null,null,null,null,null,null,null,"X"]
[null,null,"Part Number",null,null,"Description",null,null,null,null,null,null,null,null,"Manufacturer",null,"Stock","Note","Net Price","U/M","Code",null,"Disc.","Net",null,"Chg","Net Price","Disc","Act. Cost","GP%","Adj.","Group","Price",null,null,"Calc Price",".05 Round","Cents","Round to",null,"X"]
[null,null,"Pricing is subject to change without notice.",null,null,null,null,null,null,null,null,null,null,null,null,null,null,null,null,null,null,null,null,null,null,null,null,null,null,null,null,null,null,null,null,null,null,null,null,null,"X"]
[null,null,"PRICING LISTED IS NET PRICING.  TRADE DISCOUNTS DO NOT APPLY.",null,null,null,null,null,null,null,null,null,null,null,null,null,null,null,null,null,null,null,null,null,null,null,null,null,null,null,null,null,null,null,null,null,null,null,null,null,"X"]
[null,null,null,null,null,null,null,null,null,null,null,null,null,null,null,null,null,null,null,null,null,null,null,null,null,null,null,null,null,null,null,null,null,null,null,null,null,null,null,null,"X"]
[null,null,"Trowels",null,null,null,null,null,null,null,null,null,null,null,null,null,null,null,null,null,null,null,null,null,null,null,null,null,null,null,null,null,null,null,null,null,null,null,null,null,"X"]
[null,null,null,null,null,null,null,null,null,null,null,null,null,null,null,null,null,null,null,null,null,null,null,null,null,null,null,null,null,null,null,null,null,null,null,null,null,null,null,null,"X"]
[null,null,null,"U-Notched - Trowels",null,null,null,null,null,null,null,null,null,null,null,null,null,null,null,null,null,null,null,null,null,null,null,null,null,null,null,null,null,null,null,null,null,null,null,null,"X"]
["PR","Barwalt - All Other",null,"PR71073",null,"1/4 x 1/4",null,"71073 #72",null,"- Soft Grip",null,null,null,null,"Barwalt",null,null,null,{"$f":"IF(Suggested=\"Yes\",'Price List'!AA16,'Price List'!AG16)","v":10.8},"EA",{"$f":"+Instructions!$B$3","v":"N"},null,{"$f":"+Instructions!$D$22","v":0},{"$f":"ROUND($AA16*(1-W16)+0.004999,2)","v":10.8},null,"YES",10.8,{"$f":"+W16","v":0},{"$f":"+X16","v":10.8},{"$f":"(AG16-AC16)/AG16","v":0},null,{"$f":"+A16","v":"PR"},{"$f":"SUM(AJ16:AL16)+AE16","v":10.8},null,null,{"$f":"ROUND(AC16/(1-VLOOKUP(AF16,Group,2,FALSE)),2)","v":10.8},{"$f":"IF(VLOOKUP(AF16,Group,3,FALSE)=\"YES\",VLOOKUP(ROUND(ROUND(AJ16,1)-AJ16,2),Round,2,FALSE)+VLOOKUP(AF16,Group,4,FALSE),0)","v":0},{"$f":"IF(VLOOKUP(AF16,Group,5,FALSE)=\"\",0,ROUND(AJ16-0.04999,1)-AJ16+AM16)","v":0},{"$f":"IF(VLOOKUP(AF16,Group,5,FALSE)=\"\",\"\",VLOOKUP(AF16,Group,5,FALSE))","v":""},null,"X"]
["PR","Barwalt - All Other",null,"PR70959",null,"1/4 x 1/4",null,"70959 #72",null,"- Soft Grip, Stainless Steel",null,null,null,null,"Barwalt",null,"Stock","new",{"$f":"IF(Suggested=\"Yes\",'Price List'!AA17,'Price List'!AG17)","v":12.3},"EA",{"$f":"+Instructions!$B$3","v":"N"},null,{"$f":"+Instructions!$D$22","v":0},{"$f":"ROUND($AA17*(1-W17)+0.004999,2)","v":12.3},null,"new",12.3,{"$f":"+W17","v":0},{"$f":"+X17","v":12.3},{"$f":"(AG17-AC17)/AG17","v":0},null,{"$f":"+A17","v":"PR"},{"$f":"SUM(AJ17:AL17)+AE17","v":12.3},null,null,{"$f":"ROUND(AC17/(1-VLOOKUP(AF17,Group,2,FALSE)),2)","v":12.3},{"$f":"IF(VLOOKUP(AF17,Group,3,FALSE)=\"YES\",VLOOKUP(ROUND(ROUND(AJ17,1)-AJ17,2),Round,2,FALSE)+VLOOKUP(AF17,Group,4,FALSE),0)","v":0},{"$f":"IF(VLOOKUP(AF17,Group,5,FALSE)=\"\",0,ROUND(AJ17-0.04999,1)-AJ17+AM17)","v":0},{"$f":"IF(VLOOKUP(AF17,Group,5,FALSE)=\"\",\"\",VLOOKUP(AF17,Group,5,FALSE))","v":""},null,"X"]
[null,null,null,null,null,null,null,null,null,null,null,null,null,null,null,null,null,null,null,null,null,null,null,null,null,null,null,null,null,null,null,null,null,null,null,null,null,null,null,null,"X"]
["PR","Barwalt - All Other",null,"PR71079",null,"3/8 x 1/4",null,"71079 #76",null,"- Soft Grip",null,null,null,null,"Barwalt",null,null,null,{"$f":"IF(Suggested=\"Yes\",'Price List'!AA19,'Price List'!AG19)","v":10.8},"EA",{"$f":"+Instructions!$B$3","v":"N"},null,{"$f":"+Instructions!$D$22","v":0},{"$f":"ROUND($AA19*(1-W19)+0.004999,2)","v":10.8},null,"YES",10.8,{"$f":"+W19","v":0},10.8,{"$f":"(AG19-AC19)/AG19","v":0},null,{"$f":"+A19","v":"PR"},{"$f":"SUM(AJ19:AL19)+AE19","v":10.8},null,null,{"$f":"ROUND(AC19/(1-VLOOKUP(AF19,Group,2,FALSE)),2)","v":10.8},{"$f":"IF(VLOOKUP(AF19,Group,3,FALSE)=\"YES\",VLOOKUP(ROUND(ROUND(AJ19,1)-AJ19,2),Round,2,FALSE)+VLOOKUP(AF19,Group,4,FALSE),0)","v":0},{"$f":"IF(VLOOKUP(AF19,Group,5,FALSE)=\"\",0,ROUND(AJ19-0.04999,1)-AJ19+AM19)","v":0},{"$f":"IF(VLOOKUP(AF19,Group,5,FALSE)=\"\",\"\",VLOOKUP(AF19,Group,5,FALSE))","v":""},null,"X"]
["PR","Barwalt - All Other",null,"PR70960",null,"3/8 x 1/4",null,"70960 #76",null,"- Soft Grip, Stainless Steel",null,null,null,null,"Barwalt",null,"Stock",null,{"$f":"IF(Suggested=\"Yes\",'Price List'!AA20,'Price List'!AG20)","v":12.3},"EA",{"$f":"+Instructions!$B$3","v":"N"},null,{"$f":"+Instructions!$D$22","v":0},{"$f":"ROUND($AA20*(1-W20)+0.004999,2)","v":12.3},null,"YES",12.3,0,12.3,{"$f":"(AG20-AC20)/AG20","v":0},null,{"$f":"+A20","v":"PR"},{"$f":"SUM(AJ20:AL20)+AE20","v":12.3},null,null,{"$f":"ROUND(AC20/(1-VLOOKUP(AF20,Group,2,FALSE)),2)","v":12.3},{"$f":"IF(VLOOKUP(AF20,Group,3,FALSE)=\"YES\",VLOOKUP(ROUND(ROUND(AJ20,1)-AJ20,2),Round,2,FALSE)+VLOOKUP(AF20,Group,4,FALSE),0)","v":0},{"$f":"IF(VLOOKUP(AF20,Group,5,FALSE)=\"\",0,ROUND(AJ20-0.04999,1)-AJ20+AM20)","v":0},{"$f":"IF(VLOOKUP(AF20,Group,5,FALSE)=\"\",\"\",VLOOKUP(AF20,Group,5,FALSE))","v":""},null,"X"]
[null,null,null,null,null,null,null,null,null,null,null,null,null,null,null,null,null,null,null,null,null,null,null,null,null,null,null,null,null,null,null,null,null,null,null,null,null,null,null,null,"X"]
["TR","Troxell - All Other",null,"TX14-66SS",null,"3/8 x 3/8",null,"14-66SS",null,"- Soft Grip, Stainless Steel",null,null,null,null,"Troxell",null,"Stock","new",{"$f":"IF(Suggested=\"Yes\",'Price List'!AA22,'Price List'!AG22)","v":13.2},"EA",{"$f":"+Instructions!$B$3","v":"N"},null,{"$f":"+Instructions!$D$22","v":0},{"$f":"ROUND($AA22*(1-W22)+0.004999,2)","v":13.2},null,"YES",13.2,0,13.2,{"$f":"(AG22-AC22)/AG22","v":0},null,{"$f":"+A22","v":"TR"},{"$f":"SUM(AJ22:AL22)+AE22","v":13.2},null,null,{"$f":"ROUND(AC22/(1-VLOOKUP(AF22,Group,2,FALSE)),2)","v":13.2},{"$f":"IF(VLOOKUP(AF22,Group,3,FALSE)=\"YES\",VLOOKUP(ROUND(ROUND(AJ22,1)-AJ22,2),Round,2,FALSE)+VLOOKUP(AF22,Group,4,FALSE),0)","v":0},{"$f":"IF(VLOOKUP(AF22,Group,5,FALSE)=\"\",0,ROUND(AJ22-0.04999,1)-AJ22+AM22)","v":0},{"$f":"IF(VLOOKUP(AF22,Group,5,FALSE)=\"\",\"\",VLOOKUP(AF22,Group,5,FALSE))","v":""},null,"X"]
[null,null,null,null,null,null,null,null,null,null,null,null,null,null,null,null,null,null,null,null,null,null,null,null,null,null,null,null,null,null,null,null,null,null,null,null,null,null,null,null,"X"]
["PR","Barwalt - All Other",null,"PR71080",null,"1/2 x 1/4",null,"71080 #78",null,"- Soft Grip",null,null,null,null,"Barwalt",null,null,null,{"$f":"IF(Suggested=\"Yes\",'Price List'!AA24,'Price List'!AG24)","v":10.8},"EA",{"$f":"+Instructions!$B$3","v":"N"},null,{"$f":"+Instructions!$D$22","v":0},{"$f":"ROUND($AA24*(1-W24)+0.004999,2)","v":10.8},null,"YES",10.8,{"$f":"+W24","v":0},{"$f":"+X24","v":10.8},{"$f":"(AG24-AC24)/AG24","v":0},null,{"$f":"+A24","v":"PR"},{"$f":"SUM(AJ24:AL24)+AE24","v":10.8},null,null,{"$f":"ROUND(AC24/(1-VLOOKUP(AF24,Group,2,FALSE)),2)","v":10.8},{"$f":"IF(VLOOKUP(AF24,Group,3,FALSE)=\"YES\",VLOOKUP(ROUND(ROUND(AJ24,1)-AJ24,2),Round,2,FALSE)+VLOOKUP(AF24,Group,4,FALSE),0)","v":0},{"$f":"IF(VLOOKUP(AF24,Group,5,FALSE)=\"\",0,ROUND(AJ24-0.04999,1)-AJ24+AM24)","v":0},{"$f":"IF(VLOOKUP(AF24,Group,5,FALSE)=\"\",\"\",VLOOKUP(AF24,Group,5,FALSE))","v":""},null,"X"]
["PR","Barwalt - All Other",null,"PR70962",null,"1/2 x 1/4",null,"70962 #78",null,"- Soft Grip, Stainless Steel",null,null,null,null,"Barwalt",null,"Stock",null,{"$f":"IF(Suggested=\"Yes\",'Price List'!AA25,'Price List'!AG25)","v":12.3},"EA",{"$f":"+Instructions!$B$3","v":"N"},null,{"$f":"+Instructions!$D$22","v":0},{"$f":"ROUND($AA25*(1-W25)+0.004999,2)","v":12.3},null,"YES",12.3,{"$f":"+W25","v":0},{"$f":"+X25","v":12.3},{"$f":"(AG25-AC25)/AG25","v":0},null,{"$f":"+A25","v":"PR"},{"$f":"SUM(AJ25:AL25)+AE25","v":12.3},null,null,{"$f":"ROUND(AC25/(1-VLOOKUP(AF25,Group,2,FALSE)),2)","v":12.3},{"$f":"IF(VLOOKUP(AF25,Group,3,FALSE)=\"YES\",VLOOKUP(ROUND(ROUND(AJ25,1)-AJ25,2),Round,2,FALSE)+VLOOKUP(AF25,Group,4,FALSE),0)","v":0},{"$f":"IF(VLOOKUP(AF25,Group,5,FALSE)=\"\",0,ROUND(AJ25-0.04999,1)-AJ25+AM25)","v":0},{"$f":"IF(VLOOKUP(AF25,Group,5,FALSE)=\"\",\"\",VLOOKUP(AF25,Group,5,FALSE))","v":""},null,"X"]
[null,null,null,null,null,null,null,null,null,null,null,null,null,null,null,null,null,null,null,null,null,null,null,null,null,null,null,null,null,null,null,null,null,null,null,null,null,null,null,null,"X"]
["PR","Barwalt - All Other",null,"PR70956",null,"1/2 x 1/2",null,"70956 #58",null,"- Soft Grip, Stainless Steel",null,null,null,null,"Barwalt",null,"Stock","new",{"$f":"IF(Suggested=\"Yes\",'Price List'!AA27,'Price List'!AG27)","v":12.3},"EA",{"$f":"+Instructions!$B$3","v":"N"},null,{"$f":"+Instructions!$D$22","v":0},{"$f":"ROUND($AA27*(1-W27)+0.004999,2)","v":12.3},null,"new",12.3,{"$f":"+W27","v":0},{"$f":"+X27","v":12.3},{"$f":"(AG27-AC27)/AG27","v":0},null,{"$f":"+A27","v":"PR"},{"$f":"SUM(AJ27:AL27)+AE27","v":12.3},null,null,{"$f":"ROUND(AC27/(1-VLOOKUP(AF27,Group,2,FALSE)),2)","v":12.3},{"$f":"IF(VLOOKUP(AF27,Group,3,FALSE)=\"YES\",VLOOKUP(ROUND(ROUND(AJ27,1)-AJ27,2),Round,2,FALSE)+VLOOKUP(AF27,Group,4,FALSE),0)","v":0},{"$f":"IF(VLOOKUP(AF27,Group,5,FALSE)=\"\",0,ROUND(AJ27-0.04999,1)-AJ27+AM27)","v":0},{"$f":"IF(VLOOKUP(AF27,Group,5,FALSE)=\"\",\"\",VLOOKUP(AF27,Group,5,FALSE))","v":""},null,"X"]
[]
[null,null,null,"Square Notched - Trowels",null,null,null,null,null,null,null,null,null,null,null,null,null,null,null,null,null,null,null,null,null,null,null,null,null,null,null,null,null,null,null,null,null,null,null,null,"X"]
[null,null,null,null,null,null,null,null,null,null,null,null,null,null,null,null,null,null,null,null,null,null,null,null,null,null,null,null,null,null,null,null,null,null,null,null,null,null,null,null,"X"]
["PR","Barwalt - All Other",null,"PR71138",null,"1/2 x 1/2",null,"71138 #58",null,"- Soft Grip, Extra Long 16\"",null,null,null,null,"Barwalt",null,"Stock",null,{"$f":"IF(Suggested=\"Yes\",'Price List'!AA31,'Price List'!AG31)","v":12.3},"EA",{"$f":"+Instructions!$B$3","v":"N"},null,{"$f":"+Instructions!$D$22","v":0},{"$f":"ROUND($AA31*(1-W31)+0.004999,2)","v":12.3},null,"YES",12.3,{"$f":"+W31","v":0},{"$f":"+X31","v":12.3},{"$f":"(AG31-AC31)/AG31","v":0},null,{"$f":"+A31","v":"PR"},{"$f":"SUM(AJ31:AL31)+AE31","v":12.3},null,null,{"$f":"ROUND(AC31/(1-VLOOKUP(AF31,Group,2,FALSE)),2)","v":12.3},{"$f":"IF(VLOOKUP(AF31,Group,3,FALSE)=\"YES\",VLOOKUP(ROUND(ROUND(AJ31,1)-AJ31,2),Round,2,FALSE)+VLOOKUP(AF31,Group,4,FALSE),0)","v":0},{"$f":"IF(VLOOKUP(AF31,Group,5,FALSE)=\"\",0,ROUND(AJ31-0.04999,1)-AJ31+AM31)","v":0},{"$f":"IF(VLOOKUP(AF31,Group,5,FALSE)=\"\",\"\",VLOOKUP(AF31,Group,5,FALSE))","v":""},null,"X"]
[]
[null,null,null,"Euro-Notched - Trowels",null,null,null,null,null,null,null,null,null,null,null,null,null,null,null,null,null,null,null,null,null,null,null,null,null,null,null,null,null,null,null,null,null,null,null,null,"X"]
["PR","Barwalt - All Other",null,"PR71145",null,"Euro-Notch",null,"71145 #100",null,"- Soft Grip",null,null,null,null,"Barwalt",null,null,null,{"$f":"IF(Suggested=\"Yes\",'Price List'!AA34,'Price List'!AG34)","v":10.8},"EA",{"$f":"+Instructions!$B$3","v":"N"},null,{"$f":"+Instructions!$D$22","v":0},{"$f":"ROUND($AA34*(1-W34)+0.004999,2)","v":10.8},null,"YES",10.8,{"$f":"+W34","v":0},{"$f":"+X34","v":10.8},{"$f":"(AG34-AC34)/AG34","v":0},null,{"$f":"+A34","v":"PR"},{"$f":"SUM(AJ34:AL34)+AE34","v":10.8},null,null,{"$f":"ROUND(AC34/(1-VLOOKUP(AF34,Group,2,FALSE)),2)","v":10.8},{"$f":"IF(VLOOKUP(AF34,Group,3,FALSE)=\"YES\",VLOOKUP(ROUND(ROUND(AJ34,1)-AJ34,2),Round,2,FALSE)+VLOOKUP(AF34,Group,4,FALSE),0)","v":0},{"$f":"IF(VLOOKUP(AF34,Group,5,FALSE)=\"\",0,ROUND(AJ34-0.04999,1)-AJ34+AM34)","v":0},{"$f":"IF(VLOOKUP(AF34,Group,5,FALSE)=\"\",\"\",VLOOKUP(AF34,Group,5,FALSE))","v":""},null,"X"]
["PR","Barwalt - All Other",null,"PR70966",null,"Euro-Notch",null,"70966 #100",null,"- Soft Grip, Stainless Steel",null,null,null,null,"Barwalt",null,"Stock",null,{"$f":"IF(Suggested=\"Yes\",'Price List'!AA35,'Price List'!AG35)","v":12.3},"EA",{"$f":"+Instructions!$B$3","v":"N"},null,{"$f":"+Instructions!$D$22","v":0},{"$f":"ROUND($AA35*(1-W35)+0.004999,2)","v":12.3},null,"YES",12.3,{"$f":"+W35","v":0},{"$f":"+X35","v":12.3},{"$f":"(AG35-AC35)/AG35","v":0},null,{"$f":"+A35","v":"PR"},{"$f":"SUM(AJ35:AL35)+AE35","v":12.3},null,null,{"$f":"ROUND(AC35/(1-VLOOKUP(AF35,Group,2,FALSE)),2)","v":12.3},{"$f":"IF(VLOOKUP(AF35,Group,3,FALSE)=\"YES\",VLOOKUP(ROUND(ROUND(AJ35,1)-AJ35,2),Round,2,FALSE)+VLOOKUP(AF35,Group,4,FALSE),0)","v":0},{"$f":"IF(VLOOKUP(AF35,Group,5,FALSE)=\"\",0,ROUND(AJ35-0.04999,1)-AJ35+AM35)","v":0},{"$f":"IF(VLOOKUP(AF35,Group,5,FALSE)=\"\",\"\",VLOOKUP(AF35,Group,5,FALSE))","v":""},null,"X"]
["TR","Troxell - All Other",null,"TX14-EUSS",null,"Euro-Notch",null,"14-EUSS",null,"- Soft Grip, Stainless Steel",null,null,null,null,"Troxell",null,null,null,{"$f":"IF(Suggested=\"Yes\",'Price List'!AA36,'Price List'!AG36)","v":13.2},"EA",{"$f":"+Instructions!$B$3","v":"N"},null,{"$f":"+Instructions!$D$22","v":0},{"$f":"ROUND($AA36*(1-W36)+0.004999,2)","v":13.2},null,"YES",13.2,{"$f":"+W36","v":0},{"$f":"+X36","v":13.2},{"$f":"(AG36-AC36)/AG36","v":0},null,{"$f":"+A36","v":"TR"},{"$f":"SUM(AJ36:AL36)+AE36","v":13.2},null,null,{"$f":"ROUND(AC36/(1-VLOOKUP(AF36,Group,2,FALSE)),2)","v":13.2},{"$f":"IF(VLOOKUP(AF36,Group,3,FALSE)=\"YES\",VLOOKUP(ROUND(ROUND(AJ36,1)-AJ36,2),Round,2,FALSE)+VLOOKUP(AF36,Group,4,FALSE),0)","v":0},{"$f":"IF(VLOOKUP(AF36,Group,5,FALSE)=\"\",0,ROUND(AJ36-0.04999,1)-AJ36+AM36)","v":0},{"$f":"IF(VLOOKUP(AF36,Group,5,FALSE)=\"\",\"\",VLOOKUP(AF36,Group,5,FALSE))","v":""},null,"X"]
[null,null,null,null,null,null,null,null,null,null,null,null,null,null,null,null,null,null,null,null,null,null,null,null,null,null,null,null,null,null,null,null,null,null,null,null,null,null,null,null,"X"]
[null,null,null,"Schluter Sized - Trowels",null,null,null,null,null,null,null,null,null,null,null,null,null,null,null,null,null,null,null,null,null,null,null,null,null,null,null,null,null,null,null,null,null,null,null,null,"X"]
["SH","Schluter - Trowels",null,"SHTRLKER6",null,"1/8 x 1/8",null,"TRL-KER",null,"Schluter Kerdi trowel",null,null,null,null,"Schluter",null,null,null,{"$f":"IF(Suggested=\"Yes\",'Price List'!AA39,'Price List'!AG39)","v":23.15},"EA",{"$f":"+Instructions!$B$3","v":"N"},null,{"$f":"+Instructions!$D$22","v":0},{"$f":"ROUND($AA39*(1-W39)+0.004999,2)","v":23.15},null,"YES",23.15,{"$f":"+W39","v":0},{"$f":"+X39","v":23.15},{"$f":"(AG39-AC39)/AG39","v":0},null,{"$f":"+A39","v":"SH"},{"$f":"SUM(AJ39:AL39)+AE39","v":23.15},null,null,{"$f":"ROUND(AC39/(1-VLOOKUP(AF39,Group,2,FALSE)),2)","v":23.15},{"$f":"IF(VLOOKUP(AF39,Group,3,FALSE)=\"YES\",VLOOKUP(ROUND(ROUND(AJ39,1)-AJ39,2),Round,2,FALSE)+VLOOKUP(AF39,Group,4,FALSE),0)","v":0},{"$f":"IF(VLOOKUP(AF39,Group,5,FALSE)=\"\",0,ROUND(AJ39-0.04999,1)-AJ39+AM39)","v":0},{"$f":"IF(VLOOKUP(AF39,Group,5,FALSE)=\"\",\"\",VLOOKUP(AF39,Group,5,FALSE))","v":""},null,"X"]
["TR","Troxell - All Other",null,"TX1410SS",null,"1/8 x 1/8",null,"14-10SS",null,"Kerdi-Size Trowel, Soft Grip, Stainless",null,null,null,null,"Troxell",null,"Stock",null,{"$f":"IF(Suggested=\"Yes\",'Price List'!AA40,'Price List'!AG40)","v":13.2},"EA",{"$f":"+Instructions!$B$3","v":"N"},null,{"$f":"+Instructions!$D$22","v":0},{"$f":"ROUND($AA40*(1-W40)+0.004999,2)","v":13.2},null,"YES",13.2,{"$f":"+W40","v":0},{"$f":"+X40","v":13.2},{"$f":"(AG40-AC40)/AG40","v":0},null,{"$f":"+A40","v":"TR"},{"$f":"SUM(AJ40:AL40)+AE40","v":13.2},null,null,{"$f":"ROUND(AC40/(1-VLOOKUP(AF40,Group,2,FALSE)),2)","v":13.2},{"$f":"IF(VLOOKUP(AF40,Group,3,FALSE)=\"YES\",VLOOKUP(ROUND(ROUND(AJ40,1)-AJ40,2),Round,2,FALSE)+VLOOKUP(AF40,Group,4,FALSE),0)","v":0},{"$f":"IF(VLOOKUP(AF40,Group,5,FALSE)=\"\",0,ROUND(AJ40-0.04999,1)-AJ40+AM40)","v":0},{"$f":"IF(VLOOKUP(AF40,Group,5,FALSE)=\"\",\"\",VLOOKUP(AF40,Group,5,FALSE))","v":""},null,"X"]
{"$rows_left_out":492}
{"sheet":"Websites","index":3,"n_rows":16,"n_cols":2,"rows_kept":16,"cut":false,"hidden":false,"merged":[]}
["Easy Access Website links"]
[]
["ConestogaTile's Website","www.conestogatile.com"]
[]
["Manufacturer's Home Page"]
["Barwalt","www.barwalt.com"]
["European Tile Masters (ETMM)","www.europeantilemasters"]
["IQ Saws","https://iqpowertools.com/"]
["Mark E. Ind.","www.markeindustries.com"]
["MK Diamond","www.mkdiamond.com"]
["Progress Profiles","www.progressprofiles.com"]
["Rubi Tools","www.rubi.com"]
["Sigma (RTC)","www.rtcproducts.com"]
["Troxell Tools","https://troxellusa.com/"]
[]
["Product","Direct Website Link"]

{"sheet":"Updates","index":4,"n_rows":16,"n_cols":3,"rows_kept":16,"cut":false,"hidden":false,"merged":[]}
[null,"Price List"]
["Mfg","Date","Description"]
[]
["New Products"]
[]
[]
[]
[]
[]
[]
[]
[]
[]
[]
[]
["Discontinued Products"]