{"text_format":"1","workbook":"xlsx","n_sheets":5,"sheets":["Instructions","Index","Price List","Websites","Changes"],"not_rendered":{"charts":0,"images":2,"macros":1,"external_links":0,"defined_names":18,"comments":0,"pivot_tables":0},"unopened":[],"bounds":{"document_bytes":16777216,"sheet_cells":100000,"rows_first":2000,"rows_last":500,"rows_between":2000,"halvings":0,"cell_chars":16384,"cell_head_chars":4096},"cells_cut":0,"cells_raw":0,"read":"whole","date_system":"1900"}

{"sheet":"Instructions","index":0,"n_rows":58,"n_cols":10,"rows_kept":58,"cut":false,"hidden":false,"merged":[[7,2,7,7],[36,3,36,4]]}
["Manufacturer","ARC"]
["File as","A"]
["Product Code","N"]
["CCTD Effective Date","10/1/23"]
[]
[]
[]
["Enter your Company Name"]
[]
[null,"Click on \"Index\" to set the print area for the price list index"]
[null,"Then you can send it to print"]
[]
[]
[null,"Click on \"Suggested Price List\" to set the print area for Conestoga Tile's suggested price list."]
[null,"Then you can send it to print"]
[]
[]
[null,"Enter your discount codes if you want a personal net cost sheet."]
[]
[null,"Product"]
[null,"Code","Disc. %"]
[null,{"$f":"+B3","v":"N"},0,"  This is a \"NET\" price list.  0% is the discount for this spreadsheet"]
[]
[null,"Click on \"Your Cost\" to set the print area for your personal cost report."]
[null,"Then you can send it to print"]
[]
[]
["Discount: ","To help establish your price list, enter the gross profit percent for each type of product."]
[null,"If you want to use Conestoga Tile's list price, leave them blank."]
[]
["Round Nickel: ","If you always want your price to round to the nearest nickel, enter \"YES\"."]
[null,"If you enter \"NO\", it will NOT round to the nearest nickel."]
[]
["Ending Cents: ","If you always want your price to end with a certain cents, enter that cent value."]
[null,"If you leave it \"blank\" will NOT round to this cent value.",null,null,null,null,null,null,null," "]
[]
[null,"Group","GP Margin","GP Margin % for",null,"Round Nickel","add/subtract","Ending Cents"]
[null,1,null,"Stocked Pans",null,"No",0]
[null,2,null,"Non-Stock Pans",null,"No",0]
[null,3,null,"Setting Materials",null,"No",0]
{"$rows_left_out":19}
{"sheet":"Index","index":1,"n_rows":50,"n_cols":13,"rows_kept":50,"cut":false,"hidden":false,"merged":[[14,2,14,10],[5,0,5,10],[47,0,47,10],[49,0,49,10],[2,5,2,10],[10,2,10,8],[11,2,11,8],[12,2,12,8],[13,2,13,8]]}
[]
[]
[null,null,null,null,null,{"$f":"\"File '\"&Instructions!B2&\"' - \"&Instructions!B1","v":"File 'A' - ARC"}]
[]
[]
[{"$f":"\"Price List Index - \"&Instructions!B4","v":"Price List Index - 10/1/23"}]
[]
[]
[]
[]
["Page",null,"Series / Product Type"]
[1,null,"TrueDEK Classic8 Shower Bases"]
[1,null,"TrueDEK Classic Shower Bases"]
[1,null,"TrueDEK Classic Drains",null,null,null,null,null,null,null,null,null," "]
[2,null,"TrueDEK Linear Shower Bases & TrueDEK Linear Drains"]
["2-3",null,"FastDEK Shower Bases"]
[3,null,"FastDEK Linear Shower Bases"]
[3,null,"FastDEK Standalone Shower Kits"]
[3,null,"Waterproofing Kits"]
["3-4",null,"Waterproofing Supplies"]
[4,null,"FastNICHE Shower Niches"]
[4,null,"Glass Shower Screens"]
[4,null,"Glass Shower Screens & Deflector Panels"]
[4,null,"Bendy Rails"]
[4,null,"Breathable Shower Curtains"]
["4-5",null,"Caregiver Doors"]
[5,null,"Economy Shower Seats (2000 Series)"]
[5,null,"Deluxe Shower Seats with Backs & Arms (4000 Series)"]
[5,null,"Deluxe Shower Seats without Backs & Arms (4000 Series)"]
[5,null,"Deluxe Extra-Wide Shower Seats without Backs & Arms (4000 Series)"]
[5,null,"Velena Series Seats"]
["5-6",null,"Heavy-Duty Grab Bars & Supports"]
[6,null,"Transition Grab Bars"]
[6,null,"Rugao Grab Bars"]
[6,null,"Velena Wall Panels"]
[]
[]
[]
[]
[]
{"$rows_left_out":11}
{"sheet":"Price List","index":2,"n_rows":525,"n_cols":42,"rows_kept":525,"cut":false,"hidden":false,"merged":[[95,3,95,20],[18,2,18,19],[514,3,514,4],[17,15,17,16],[508,2,508,20],[510,2,510,20],[94,3,94,20],[336,3,336,4],[13,31,13,33],[10,15,10,16],[9,15,9,20],[9,23,9,24],[9,26,9,33],[12,23,12,24],[12,14,12,20],[14,14,15,20]]}
[null,"Stocked Pans",null,null,"Size",null,"Item #",null,"Description",null,null,null,null,null,null,null,null,null,null,{"$f":"IF(Suggested=\"Yes\",AB1,AH1)","v":0.05},"EA",{"$f":"+Instructions!$B$3","v":"N"},null,{"$f":"+Instructions!$C$22","v":0},{"$f":"ROUND($AB1*(1-X1)+0.004999,2)","v":0.05},null,"new",0.05,{"$f":"+X1","v":0},0.05,{"$f":"(AH1-AD1)/AH1","v":0},null,1,{"$f":"SUM(AK1:AM1)+AF1","v":0.05},null,null,{"$f":"ROUND(AD1/(1-VLOOKUP(AG1,Group,2,FALSE)),2)","v":0.05},{"$f":"IF(VLOOKUP(AG1,Group,5,FALSE)=\"YES\",VLOOKUP(ROUND(ROUND(AK1,1)-AK1,2),Round,2,FALSE)+VLOOKUP(AG1,Group,6,FALSE),0)","v":0},{"$f":"IF(VLOOKUP(AG1,Group,7,FALSE)=\"\",0,ROUND(AK1-0.04999,1)-AK1+AN1)","v":0},{"$f":"IF(VLOOKUP(AG1,Group,7,FALSE)=\"\",\"\",VLOOKUP(AG1,Group,7,FALSE))","v":""},null,"X"]
[null,"Non-Stock Pans",null,null,"Size",null,"Item #",null,"Description",null,null,null,null,null,null,null,null,null,null,{"$f":"IF(Suggested=\"Yes\",AB2,AH2)","v":0.05},"EA",{"$f":"+Instructions!$B$3","v":"N"},null,{"$f":"+Instructions!$C$22","v":0},0.05,null,"new",0.05,0,0.05,0,null,2,0.05,null,null,0.05,0,0,"",null,"X"]
[null,"Setting Materials",null,null,"Size",null,"Item #",null,"Description",null,null,null,null,null,null,null,null,null,null,{"$f":"IF(Suggested=\"Yes\",AB3,AH3)","v":0.05},"EA",{"$f":"+Instructions!$B$3","v":"N"},null,{"$f":"+Instructions!$C$22","v":0},{"$f":"ROUND($AB3*(1-X3)+0.004999,2)","v":0.05},null,"new",0.05,{"$f":"+X3","v":0},{"$f":"+Y3","v":0.05},{"$f":"(AH3-AD3)/AH3","v":0},null,3,{"$f":"SUM(AK3:AM3)+AF3","v":0.05},null,null,{"$f":"ROUND(AD3/(1-VLOOKUP(AG3,Group,2,FALSE)),2)","v":0.05},{"$f":"IF(VLOOKUP(AG3,Group,5,FALSE)=\"YES\",VLOOKUP(ROUND(ROUND(AK3,1)-AK3,2),Round,2,FALSE)+VLOOKUP(AG3,Group,6,FALSE),0)","v":0},{"$f":"IF(VLOOKUP(AG3,Group,7,FALSE)=\"\",0,ROUND(AK3-0.04999,1)-AK3+AN3)","v":0},{"$f":"IF(VLOOKUP(AG3,Group,7,FALSE)=\"\",\"\",VLOOKUP(AG3,Group,7,FALSE))","v":""},null,"X"]
[null,"Accessories",null,null,"Size",null,"Item #",null,"Description",null,null,null,null,null,null,null,null,null,null,0.05,"EA",{"$f":"+Instructions!$B$3","v":"N"},null,{"$f":"+Instructions!$C$22","v":0},0.05,null,"new",0.05,0,0.05,0,null,4,0.05,null,null,0.05,0,0,"",null,"X"]
[null,0,null,null,"Size",null,"Item #",null,"Description",null,null,null,null,null,null,null,null,null,null,0,"EA",{"$f":"+Instructions!$B$3","v":"N"},null,{"$f":"+Instructions!$C$22","v":0},0,null,"new",0,0,0,{"$error":"#DIV/0!"},null,5,0,null,null,0,0,0,"",null,"X"]
[null,0,null,null,"Size",null,"Item #",null,"Description",null,null,null,null,null,null,null,null,null,null,0,"EA",{"$f":"+Instructions!$B$3","v":"N"},null,{"$f":"+Instructions!$C$22","v":0},0,null,"new",0,0,0,{"$error":"#DIV/0!"},null,6,0,null,null,0,0,0,"",null,"X"]
[null,0,null,null,"Size",null,"Item #",null,"Description",null,null,null,null,null,null,null,null,null,null,0,"EA",{"$f":"+Instructions!$B$3","v":"N"},null,{"$f":"+Instructions!$C$22","v":0},0,null,"new",0,0,0,{"$error":"#DIV/0!"},null,7,0,null,null,0,0,0,"",null,"X"]
[null,"Format",null,null,null,null,null,null,null,null,null,null,null,null,null,null,null,"Stock","a",1000,"ABC",null,null,0.1,1000,null,"ABC",1000,0.1,1000,0.1,10,null,1000,null,null,null,null,null,null,null,"X"]
[null,null,null,null,null,null,null,null,null,null,null,null,null,null,null,null,null,null,null,null,null,null,null,null,null,null,null,null,null,null,null,null,null,null,null,null,null,null,null,null,null,"X"]
[null,null,null,null,null,null,null,null,null,null,null,null,null,null,null,"Price List",null,null,null,null,null,null,null,"Cust. Cost",null,null,"Customer Cost Calculation",null,null,null,null,null,null,null,null,null,null,null,null,null,null,"X"]
[null,null,null,"Sizes & Shapes",null,null,null,null,null,null,null,null,null,null,null,"Full Carton",null,"Stock","Note",{"$f":"IF(Suggested=\"Yes\",AB11,AH11)","v":"Net Price"},"U/M","Code",null,"Disc.","Net",null,"Chg","Net Price","Disc","Act. Cost","GP%","Adj.","Group","Price",null,null,"Calc Price",".05 Round","Cents","Round to",null,"X"]
[null,null,null,null,null,null,null,null,null,null,null,null,null,null,null,null,null,null,null,null,null,null,null,null,null,null,null,null,null,null,null,null,null,null,null,null,null,null,null,null,null,"X"]
[null,null,null,null,null,null,null,null,null,null,null,null,null,null,{"$f":"\"File '\"&Instructions!B2&\"' - \"&Instructions!B1","v":"File 'A' - ARC"},null,null,null,null,null,null,null,null,"Cost",null,null,null,null,null,null,null,null,null,"Retail Price Calculations",null,null,null,null,null,null,null,"X"]
[null,null,null,null,null,null,null,null,null,null,null,null,null,null,null,null,null,null,null,null,{"$f":"+Instructions!B4","v":"10/1/23"},null,null,null,null,null,null,null,null,null,null,{"$f":"TODAY()","v":"2023-09-06"},null,null,null,null,null,null,null,null,null,"X"]
[null,null,null,null,null,null,null,null,null,null,null,null,null,null,{"$f":"IF(Instructions!C8=\"\",\"\",+Instructions!C8)","v":""},null,null,null,null,null,null,null,null,null,null,null,null,null,null,null,null,null,null,null,null,null,null,null,null,null,null,"X"]
[null,null,{"$f":"\"Product Code '\"&Instructions!B3&\"'\"","v":"Product Code 'N'"},null,null,null,null,null,null,null,null,null,null,null,null,null,null,null,null,null,null,null,null,null,null,null,null,null,null,null,null,null,null,{"$f":"IF(Instructions!$C$8=\"\",\"\",Instructions!$C$8)","v":""},null,null,null,null,null,null,null,"X"]
[null,null,null,null,null,null,null,null,null,null,null,null,null,null,null,null,null,null,null,null,null,null,null,null,null,null,null,null,null,null,null,null,null,null,null,null,null,null,null,null,null,"X"]
[null,null,"Sizes & Shapes",null,null,null,null,null,null,null,null,null,null,null,null,null,null,"Stock","Note",{"$f":"+T$11","v":"Net Price"},"U/M",{"$f":"+V$11","v":"Code"},null,"Disc.","Net",null,"Chg","Net Price",{"$f":"+AC$11","v":"Disc"},"Act. Cost","GP%","Adj.",{"$f":"+AG$11","v":"Group"},"Price",null,null,"Calc Price",".05 Round","Cents","Round to",null,"X"]
[null,null,"PRICING LISTED IS NET PRICING. TRADE DISCOUNTS DO NOT APPLY.",null,null,null,null,null,null,null,null,null,null,null,null,null,null,null,null,null,null,null,null,null,null,null,null,null,null,null,null,null,null,null,null,null,null,null,null,null,null,"X"]
[null,null,null,null,null,null,null,null,null,null,null,null,null,null,null," ",null,null,null,null,null,null,null,null,null,null,null,null,null,null,null,null,null,null,null,null,null,null,null,null,null,"X"]
[null,null,"TrueDEK Classic8 Shower Bases - 7/8\" Thick at edges",null,null,null,null,null,null,null,null,null,null,null,null,null,null,null,"Item # Lookup:","AKTF8",null,null,null,null,null,null,null,null,null,null,null,null,null,null,null,null,null,null,null,null,null,"X"]
[null,null,null,null,null,null,null,null,null,null,null,null,null,null,null,null,null,null,null,null,null,null,null,null,null,null,null,null,null,null,null,null,null,null,null,null,null,null,null,null,null,"X"]
[null,null,null,"The new TrueDEK Classic8 line of shower bases offers all the exceptional qualities of a TrueDEK Classic with the added benefit"]
[null,null,null,"of a rotating drain plate.  This plate allows you to index the drain in 8 positions, including centered on the base.  Turning the base"]
[null,null,null,"180 degrees results in 7 more unique drain positions, for a total of 15 options to get the best drain position for your shower."]
[null,null,null,"With the fully pitched drain plate, there’s consistent and efficient water drainage throughout the entire shower area."]
[]
[null,"Non-Stock Pans",null,null,"35-1/2\" x 35-1/2\"",null,21130,null,null,null,null,null,null,null,null,null,null,null,null,{"$f":"IF(Suggested=\"Yes\",AB28,AH28)","v":694.2},"EA",{"$f":"+Instructions!$B$3","v":"N"},null,{"$f":"+Instructions!$C$22","v":0},{"$f":"ROUND($AB28*(1-X28)+0.004999,2)","v":694.2},null,"",694.2,{"$f":"+X28","v":0},{"$f":"+Y28","v":694.2},{"$f":"(AH28-AD28)/AH28","v":0},null,2,{"$f":"SUM(AK28:AM28)+AF28","v":694.2},null,null,{"$f":"ROUND(AD28/(1-VLOOKUP(AG28,Group,2,FALSE)),2)","v":694.2},{"$f":"IF(VLOOKUP(AG28,Group,5,FALSE)=\"YES\",VLOOKUP(ROUND(ROUND(AK28,1)-AK28,2),Round,2,FALSE)+VLOOKUP(AG28,Group,6,FALSE),0)","v":0},{"$f":"IF(VLOOKUP(AG28,Group,7,FALSE)=\"\",0,ROUND(AK28-0.04999,1)-AK28+AN28)","v":0},{"$f":"IF(VLOOKUP(AG28,Group,7,FALSE)=\"\",\"\",VLOOKUP(AG28,Group,7,FALSE))","v":""},null,"X"]
[null,"Non-Stock Pans",null,null,"39-3/8\" x 39-3/8\"",null,21131,null,null,null,null,null,null,null,null,null,null,null,null,694.65,"EA",{"$f":"+Instructions!$B$3","v":"N"},null,{"$f":"+Instructions!$C$22","v":0},694.65,null,"",694.65,0,694.65,0,null,2,694.65,null,null,694.65,0,0,"",null,"X"]
[null,"Non-Stock Pans",null,null,"44-3/4\" x 30-1/4\"",null,21132,null,null,null,null,null,null,null,null,null,null,null,null,694.45,"EA",{"$f":"+Instructions!$B$3","v":"N"},null,{"$f":"+Instructions!$C$22","v":0},694.45,null,"",694.45,0,694.45,0,null,2,694.45,null,null,694.45,0,0,"",null,"X"]
[null,"Stocked Pans",null,null,"47-1/4\" x 47-1/4\"",null,21133,null,null,null,null,null,null,null,null,null,null,"Stock",null,{"$f":"IF(Suggested=\"Yes\",AB31,AH31)","v":695.3},"EA",{"$f":"+Instructions!$B$3","v":"N"},null,{"$f":"+Instructions!$C$22","v":0},695.3,null,"new",695.3,0,695.3,0,null,1,695.3,null,null,695.3,0,0,"",null,"X"]
[null,"Non-Stock Pans",null,null,"51-1/4\" x 32-1/4\"",null,21134,null,null,null,null,null,null,null,null,null,null,null,null,694.65,"EA",{"$f":"+Instructions!$B$3","v":"N"},null,{"$f":"+Instructions!$C$22","v":0},694.65,null,"",694.65,0,694.65,0,null,2,694.65,null,null,694.65,0,0,"",null,"X"]
[null,"Non-Stock Pans",null,null,"55-1/8\" x 35-1/2\"",null,21135,null,null,null,null,null,null,null,null,null,null,null,null,694.9,"EA",{"$f":"+Instructions!$B$3","v":"N"},null,{"$f":"+Instructions!$C$22","v":0},694.9,null,"",694.9,0,694.9,0,null,2,694.9,null,null,694.9,0,0,"",null,"X"]
[null,"Stocked Pans",null,null,"59\" x 32-1/4\"",null,21136,null,null,null,null,null,null,null,null,null,null,"Stock",null,{"$f":"IF(Suggested=\"Yes\",AB34,AH34)","v":694.9},"EA",{"$f":"+Instructions!$B$3","v":"N"},null,{"$f":"+Instructions!$C$22","v":0},{"$f":"ROUND($AB34*(1-X34)+0.004999,2)","v":694.9},null,"new",694.9,{"$f":"+X34","v":0},{"$f":"+Y34","v":694.9},{"$f":"(AH34-AD34)/AH34","v":0},null,1,{"$f":"SUM(AK34:AM34)+AF34","v":694.9},null,null,{"$f":"ROUND(AD34/(1-VLOOKUP(AG34,Group,2,FALSE)),2)","v":694.9},{"$f":"IF(VLOOKUP(AG34,Group,5,FALSE)=\"YES\",VLOOKUP(ROUND(ROUND(AK34,1)-AK34,2),Round,2,FALSE)+VLOOKUP(AG34,Group,6,FALSE),0)","v":0},{"$f":"IF(VLOOKUP(AG34,Group,7,FALSE)=\"\",0,ROUND(AK34-0.04999,1)-AK34+AN34)","v":0},{"$f":"IF(VLOOKUP(AG34,Group,7,FALSE)=\"\",\"\",VLOOKUP(AG34,Group,7,FALSE))","v":""},null,"X"]
[null,"Stocked Pans",null,null,"59\" x 47-1/4\"",null,21137,null,null,null,null,null,null,null,null,null,null,"Stock",null,{"$f":"IF(Suggested=\"Yes\",AB35,AH35)","v":759.45},"EA",{"$f":"+Instructions!$B$3","v":"N"},null,{"$f":"+Instructions!$C$22","v":0},{"$f":"ROUND($AB35*(1-X35)+0.004999,2)","v":759.45},null,"new",759.45,{"$f":"+X35","v":0},{"$f":"+Y35","v":759.45},{"$f":"(AH35-AD35)/AH35","v":0},null,1,{"$f":"SUM(AK35:AM35)+AF35","v":759.45},null,null,{"$f":"ROUND(AD35/(1-VLOOKUP(AG35,Group,2,FALSE)),2)","v":759.45},{"$f":"IF(VLOOKUP(AG35,Group,5,FALSE)=\"YES\",VLOOKUP(ROUND(ROUND(AK35,1)-AK35,2),Round,2,FALSE)+VLOOKUP(AG35,Group,6,FALSE),0)","v":0},{"$f":"IF(VLOOKUP(AG35,Group,7,FALSE)=\"\",0,ROUND(AK35-0.04999,1)-AK35+AN35)","v":0},{"$f":"IF(VLOOKUP(AG35,Group,7,FALSE)=\"\",\"\",VLOOKUP(AG35,Group,7,FALSE))","v":""},null,"X"]
[null,"Non-Stock Pans",null,null,"70-7/8\" x 32-1/4\"",null,21138,null,null,null,null,null,null,null,null,null,null,null,null,759,"EA",{"$f":"+Instructions!$B$3","v":"N"},null,{"$f":"+Instructions!$C$22","v":0},759,null,"",759,0,759,0,null,2,759,null,null,759,0,0,"",null,"X"]
[null,null,null,null,null,null,null,null,null,null,null,null,null,null,null,null,null,null,null,null,null,null,null,null,null,null,null,null,null,null,null,null,null,null,null,null,null,null,null,null,null,"X"]
[null,"Stocked Pans",null,null,"12\" x 60\"",null,"TB6012-PXT",null,null,null,"TruePITCH Extension",null,null,null,null,null,null,"Stock",null,{"$f":"IF(Suggested=\"Yes\",AB38,AH38)","v":83.3},"EA",{"$f":"+Instructions!$B$3","v":"N"},null,{"$f":"+Instructions!$C$22","v":0},{"$f":"ROUND($AB38*(1-X38)+0.004999,2)","v":83.3},null,"new",83.3,{"$f":"+X38","v":0},{"$f":"+Y38","v":83.3},{"$f":"(AH38-AD38)/AH38","v":0},null,1,{"$f":"SUM(AK38:AM38)+AF38","v":83.3},null,null,{"$f":"ROUND(AD38/(1-VLOOKUP(AG38,Group,2,FALSE)),2)","v":83.3},{"$f":"IF(VLOOKUP(AG38,Group,5,FALSE)=\"YES\",VLOOKUP(ROUND(ROUND(AK38,1)-AK38,2),Round,2,FALSE)+VLOOKUP(AG38,Group,6,FALSE),0)","v":0},{"$f":"IF(VLOOKUP(AG38,Group,7,FALSE)=\"\",0,ROUND(AK38-0.04999,1)-AK38+AN38)","v":0},{"$f":"IF(VLOOKUP(AG38,Group,7,FALSE)=\"\",\"\",VLOOKUP(AG38,Group,7,FALSE))","v":""},null,"X"]
[null,null,null,null,null,null,null,null,null,null,null,null,null,null,null,null,null,null,null,null,null,null,null,null,null,null,null,null,null,null,null,null,null,null,null,null,null,null,null,null,null,"X"]
[null,null,"TrueDEK Classic Shower Bases - 7/8\" Thick at edges",null,null,null,null,null,null,null,null,null,null,null,null,null,null,null,"Item # Lookup:","AKTF",null,null,null,null,null,null,null,null,null,null,null,null,null,null,null,null,null,null,null,null,null,"X"]
{"$rows_left_out":486}
{"sheet":"Websites","index":3,"n_rows":8,"n_cols":2,"rows_kept":8,"cut":false,"hidden":false,"merged":[]}
["Easy Access Website links"]
[]
["ConestogaTile's Website","www.conestogatile.com"]
[]
["Manufacturer's Home Page","http://arcfirst.net/"]
[]
[]
["Product","Direct Website Link"]

{"sheet":"Changes","index":4,"n_rows":152,"n_cols":3,"rows_kept":152,"cut":false,"hidden":false,"merged":[[142,1,142,2]]}
["Date"]
["Announced","Series","Description"]
[]
["New Products"]
["2011-08-17","Wave Shower Pan w/Integrated Clamp"]
["2011-08-17","Wave Shower Accessories"]
["2012-05-08","Tuff-Form Installation Materials","Standard Waterproofing Kits now available with Stainless Steel Grate (ARC565), Satin Brass Grate (ARC565SB) & Oil-Rubbed Bronze Grate (ARC565ORB). "]
["2012-05-08","Tuff-Form Installation Materials","Premium Waterproofing Kits now available, also with choice of Stainless Steel Grate (ARC566), Satin Brass Grate (ARC566SB) & Oil-Rubbed Bronze Grate (ARC566ORB)."]
["2013-09-05","TriForm Shower Bases & Linear Drains"]
["2015-08-19","TrueDEK Shower Foundation","TB5936-TR-S, 59\" x 36\" Tub Replacement Pan (Center drain hole located at the end)."]
["2016-03-01","TrueDEK Classic Foundation","TB5959-S, 59\" x 59\" Classic Base"]
["2016-03-01","TrueDEK Waterproofing Installation Materials:","WP1050-STD Standard Waterproofing Kit"]
[null," ","WP1000-PRE Premium Waterproofing Kit"]
[null," ","WP1090-PRO Pro Waterproofing Kit"]
[null," ","(The above Waterproofing Kits do not include the Drain Assemblies w/Grates)"]
[null," ","WP2001-TNK Tank/10 Waterproofing Compound 1 Gallon size"]
[null," ","WP2002-TNK Tank/10 Waterproofing Compound 2 Gallon size"]
[null," ","WP3425-JRT, 5\" x 25' Roll Joint Reinforcement Tape"]
[null," ","WP3450-JRT 5\" x 50' Roll Joint Reinforcement Tape"]
[null," ","WP3490-JRT, 5\" x 490' Roll Joint Reinforcement Tape"]
[null," ","WP3101-INT Internal Corner & WP3201-EXT External Corner (sold by the single piece)"]
[null," ","WP3112-INT Internal Corner and WP3212-EXT External Corner (sold 12 Pieces/SET)"]
["2016-03-01","Mullen Shower Accessories","MB0060-TLA Tiling Adaptor Kit (Fits 60\" Alcove Bases)"]
["2016-03-01","Caregiver Doors","CD2021-HG Door Handle, Hinged (for use with Mullen Base)"]
[null," ","CD2022-FX Door Handle, Fixed (for use with Mullen Base) "]
["2016-03-01","Velena Devote Shower Seats","Shower Seats with sleek appeal for modern spa-style showers"]
["2016-03-01","Velena Grab Bars","Grab Bars with modern, elegant and slim styling"]
["2016-05-31","TrueDEK Installation Materials","CD1290-CH Drain Assembly w/ Chrome Grate."]
["2017-04-03","TrueDEK Installation Materials","CD1250-BS Drain Assembly w/ Brushed Stainless Steel Pinhole Pattern Grate, CD1240-ORB Drain Assembly w/ Oil-Rubbed Bronze Pinhole Pattern Grate and CD1280-CH Drain Assembly w/ Polished Stainless Steel Pinhole Pattern Grate."]
["2017-04-03","MaxBench Shower Bench with Adjustable Height","BB1000-WH 25-1/4\" wide seat Fold-up shower seat."]
["2017-08-14","TrueDEK Installation Materials","CD1220-BS Drain Assembly w/ Brushed Stainless Steel Grid Pattern Grate, CD1222-ORB Drain Assembly w/ Oil-Rubbed Bronze Grid Pattern Grate and CD1221-CH Drain Assembly w/ Polished Stainless Steel Grid Pattern Grate."]
["2017-08-14","TrueDEK/TriForm Linear Shower Foundations","TrueDEK Shuffle Linear Drain Shower Receptor Bases added."]
["2018-02-12","TrueDEK Waterproofing/Tuff-Form Installation Materials","5 Gallon WP2005-TNK Tank/10 Waterproofing Compound now available."]
["2018-04-06","ShuffleDEK Shower Bases","Left and Right Hand Stainless Steel Trim pieces added."]
["2018-04-06","TrueDEK Classic Shower Bases","TB1616-S, 16\" x 16\" Classic Base added."]
["2018-04-06","TrueDEK Waterproofing/Installation Materials","The following items have been added to the WP1090-PRO Pro Waterproofing Kit:  32 #9 x 2\" Premium Torx-drive Coated Screws, 1 Torx Bit Driver, 6 10 oz. tubes of Tank/10 Polyurethane Construction Adhesive, 1 10 oz. tube of Painter's Acrylic Latex Caulk, 2 Pairs of Nitrile Gloves, 1 Paint Roller Handle, 2 Paint Roller Covers and 1 Paint Brush.  (These updated kits will be available once our inventory of the old kits is sold.  The Net Price for the new updated kits will be $234.80 Each.)"]
["2018-04-06","TrueDEK Waterproofing/Installation Materials","Now available individually by the full carton:  WP2112-TNK Tank/10 Polyurethane Construction Adhesive, WP4010-PAC Painter's Acrylic Latex Caulk and WP4011-SCR #9 x 2\" Premium Torx-drive Coated Screws."]
["2018-11-20","TrueDEK Classic Shower Bases","TB4812-PXT 48\" x 12\" TruDEK Pitch Extension added."]
["2019-03-12","FastDEK Shower Bases","No Tile bases with finished anti-slip texture finish.  Available in colors Black, Gray and White."]
["2019-03-12","TrueDEK Classic Shower Bases","TB6535-S 65\" x 35-1/2\" Shower Base added."]
{"$rows_left_out":112}