{"text_format":"1","workbook":"xlsx","n_sheets":5,"sheets":["Instructions","Index","Price List","Websites","Changes"],"not_rendered":{"charts":0,"images":2,"macros":1,"external_links":0,"defined_names":18,"comments":0,"pivot_tables":0},"unopened":[],"bounds":{"document_bytes":16777216,"sheet_cells":100000,"rows_first":2000,"rows_last":500,"rows_between":2000,"halvings":0,"cell_chars":16384,"cell_head_chars":4096},"cells_cut":0,"cells_raw":0,"read":"whole","date_system":"1900"}

{"sheet":"Instructions","index":0,"n_rows":58,"n_cols":10,"rows_kept":58,"cut":false,"hidden":false,"merged":[[7,2,7,7],[36,3,36,4]]}
["Manufacturer","Ape"]
["File as","A"]
["Product Code","B"]
["CCTD Effective Date","5/1/23 (Updated)"]
[]
[]
[]
["Enter your Company Name"]
[]
[null,"Click on \"Index\" to set the print area for the price list index"]
[null,"Then you can send it to print"]
[]
[]
[null,"Click on \"Suggested Price List\" to set the print area for Conestoga Tile's suggested price list."]
[null,"Then you can send it to print"]
[]
[]
[null,"Enter your discount codes if you want a personal net cost sheet."]
[]
[null,"Product"]
[null,"Code","Disc. %"]
[null,{"$f":"+B3","v":"B"}]
[]
[null,"Click on \"Your Cost\" to set the print area for your personal cost report."]
[null,"Then you can send it to print"]
[]
[]
["Discount: ","To help establish your price list, enter the gross profit percent for each type of product."]
[null,"If you want to use Conestoga Tile's list price, leave them blank."]
[]
["Round Nickel: ","If you always want your price to round to the nearest nickel, enter \"YES\"."]
[null,"If you enter \"NO\", it will NOT round to the nearest nickel."]
[]
["Ending Cents: ","If you always want your price to end with a certain cents, enter that cent value."]
[null,"If you leave it \"blank\" will NOT round to this cent value."]
[]
[null,"Group","GP Margin","GP Margin % for",null,"Round Nickel","add/subtract","Ending Cents"]
[null,1,null,"Field Tile",null,"No",0]
[null,2,null,"Trim",null,"No",0,null,null," "]
[null,3,null,"Decos",null,"No",0]
[null,4,null,0,null,"No",0]
[null,5,null,0,null,"No",0]
[null,6,null,0,null,"No",0]
[null,7,null,0,null,"No",0]
[]
["If you want to manually adjust your price list, hit \"F5\" and go to \"Customer_Cost\" to manually adjust pricing."]
["You can enter a value in the column labeled \"Adj.\" to change your price manually."]
[]
[null,"Click on \"Your Price Calculation\" to set the print area for your personal cost calculation report."]
[null,"Then you can send it to print"]
[]
[]
[null,"Click on \"Your Price List\" to set the print area for your personal price list."]
[null,"Then you can send it to print"]
[null,null,null,null,null,null,null,"Yes"]
[]
["If you have any questions on how to best use this spreadsheet, please feel free to contact"]
["Jim Vogel at (800) 422-6860, ext. 4201 or via e-mail at jimvogel@cctd.com"]

{"sheet":"Index","index":1,"n_rows":54,"n_cols":6,"rows_kept":54,"cut":false,"hidden":false,"merged":[[5,0,5,10],[51,0,51,10],[53,0,53,10],[2,5,2,10],[3,4,3,7],[10,4,10,8],[11,4,11,8],[12,4,12,8],[13,4,13,8],[14,4,14,8],[15,4,15,8],[16,4,16,8],[17,4,17,8],[18,4,18,8],[19,4,19,8],[20,4,20,8],[26,4,26,8],[21,4,21,8],[22,4,22,8],[23,4,23,8],[24,4,24,8],[25,4,25,8]]}
[]
[]
[null,null,null,null,null,{"$f":"\"File '\"&Instructions!B2&\"' - \"&Instructions!B1","v":"File 'A' - Ape"}]
[]
[]
[{"$f":"\"Price List Index - \"&Instructions!B4","v":"Price List Index - 5/1/23 (Updated)"}]
[]
[]
[]
[]
["Page",null,"Series",null,"Product Type"]
["1",null,"Altea",null,"Glazed Ceramic Wall"]
[1,null,"Calacatta Slow",null,"Glazed Ceramic Wall & Glazed Porcelain Floor"]
[1,null,"Calpe",null,"Glazed Ceramic Wall"]
[1,null,"Dynamic",null,"Glazed Ceramic Wall"]
[1,null,"Fado",null,"Glazed Ceramic Wall"]
[1,null,"Grunge",null,"Glazed Ceramic Wall"]
[1,null,"Hamptons",null,"Glazed Ceramic Wall"]
[1,null,"Memories",null,"Glazed Ceramic Wall"]
[1,null,"Murus",null,"Glazed Porcelain Wall"]
[2,null,"Onyx Slow",null,"Glazed Ceramic Wall & Glazed Porcelain Floor"]
[2,null,"Savannah",null,"Glazed Ceramic Wall"]
[2,null,"Seville",null,"Glazed Ceramic Wall"]
[2,null,"Switch",null,"Glazed Ceramic Wall & Glazed Porcelain Floor"]
[2,null,"Toscana",null,"Glazed Porcelain"]
[2,null,"Verona",null,"Glazed Ceramic Wall & Glazed Porcelain Floor"]
[2,null,"Vintage",null,"Glazed Ceramic Wall"]
[]
[]
[]
[]
[]
[]
[]
[]
[]
[]
[]
[]
[]
[]
[]
[]
[]
[]
[]
[]
[]
[]
[]
[]
["This price list is available electronically on an Excel spreadsheet at www.conestogatile.com/pricelists."]
[]
["The spreadsheet has many special features to assist you.  Apply your discount to generate your net costs for your purchasing department.  Apply your standard gross margin percentage or custom prices to generate your own custom price list for your showroom.  Print out individual price list for each series that can be attached to the back of your sample boards for easy reference."]

{"sheet":"Price List","index":2,"n_rows":225,"n_cols":39,"rows_kept":225,"cut":false,"hidden":false,"merged":[[207,2,207,17],[9,23,9,30],[12,20,12,21],[9,20,9,21],[209,2,209,17],[208,2,208,17],[206,2,206,17],[13,28,13,30],[14,12,15,17],[12,12,12,17],[204,2,204,17],[9,12,9,17],[18,2,18,17],[17,12,17,13],[19,2,19,17],[10,12,10,13]]}
[null,"Field Tile",null,null,"Size",null,"Field",null,null,null,null,null,null,"SF/CTN",null,null,{"$f":"IF(Suggested=\"Yes\",Y1,AE1)","v":0.05},"SF",{"$f":"+Instructions!$B$3","v":"B"},null,{"$f":"+Instructions!$C$22","v":0},{"$f":"ROUND($Y1*(1-U1)+0.004999,2)","v":0.05},null,"new",0.05,{"$f":"+U1","v":0},0.05,{"$f":"(AE1-AA1)/AE1","v":0},null,1,{"$f":"SUM(AH1:AJ1)+AC1","v":0.05},null,null,{"$f":"ROUND(AA1/(1-VLOOKUP(AD1,Group,2,FALSE)),2)","v":0.05},{"$f":"IF(VLOOKUP(AD1,Group,5,FALSE)=\"YES\",VLOOKUP(ROUND(ROUND(AH1,1)-AH1,2),Round,2,FALSE)+VLOOKUP(AD1,Group,6,FALSE),0)","v":0},{"$f":"IF(VLOOKUP(AD1,Group,7,FALSE)=\"\",0,ROUND(AH1-0.04999,1)-AH1+AK1)","v":0},{"$f":"IF(VLOOKUP(AD1,Group,7,FALSE)=\"\",\"\",VLOOKUP(AD1,Group,7,FALSE))","v":""},null,"X"]
[null,"Trim",null,null,"Size",null,"Shape",null,"Description",null,null,null,null,null,null,null,{"$f":"IF(Suggested=\"Yes\",Y2,AE2)","v":0.05},"EA",{"$f":"+Instructions!$B$3","v":"B"},null,{"$f":"+Instructions!$C$22","v":0},0.05,null,"new",0.05,0,0.05,0,null,2,0.05,null,null,0.05,0,0,"",null,"X"]
[null,"Decos",null,null,"Size",null,"Shape",null,"Description",null,null,null,null,null,null,null,{"$f":"IF(Suggested=\"Yes\",Y3,AE3)","v":0.05},"EA",{"$f":"+Instructions!$B$3","v":"B"},null,{"$f":"+Instructions!$C$22","v":0},0.05,null,"new",0.05,0,0.05,0,null,3,0.05,null,null,0.05,0,0,"",null,"X"]
[null,0,null,null,"Size",null,"Shape",null,"Description",null,null,null,null,null,null,null,{"$f":"IF(Suggested=\"Yes\",'Price List'!Y4,'Price List'!AE4)","v":0},"EA",{"$f":"+Instructions!$B$3","v":"B"},null,{"$f":"+Instructions!$C$22","v":0},0,null,"new",0,0,0,{"$error":"#DIV/0!"},null,4,0,null,null,0,0,0,"",null,"X"]
[null,0,null,null,"Size",null,"Shape",null,"Description",null,null,null,null,null,null,null,{"$f":"IF(Suggested=\"Yes\",'Price List'!Y5,'Price List'!AE5)","v":0},"EA",{"$f":"+Instructions!$B$3","v":"B"},null,{"$f":"+Instructions!$C$22","v":0},0,null,"new",0,0,0,{"$error":"#DIV/0!"},null,5,0,null,null,0,0,0,"",null,"X"]
[null,0,null,null,"Size",null,"Shape",null,"Description",null,null,null,null,null,null,null,{"$f":"IF(Suggested=\"Yes\",'Price List'!Y6,'Price List'!AE6)","v":0},"EA",{"$f":"+Instructions!$B$3","v":"B"},null,{"$f":"+Instructions!$C$22","v":0},0,null,"new",0,0,0,{"$error":"#DIV/0!"},null,6,0,null,null,0,0,0,"",null,"X"]
[null,0,null,null,"Size",null,"Shape",null,"Description",null,null,null,null,null,null,null,{"$f":"IF(Suggested=\"Yes\",'Price List'!Y7,'Price List'!AE7)","v":0},"EA",{"$f":"+Instructions!$B$3","v":"B"},null,{"$f":"+Instructions!$C$22","v":0},0,null,"new",0,0,0,{"$error":"#DIV/0!"},null,7,0,null,null,0,0,0,"",null,"X"]
[null,"Format",null,null,null,null,null,null,null,null,null,null,null,null,"Stock","a",1000,"ABC",null,null,0.1,1000,null,"ABC",1000,0.1,1000,0.1,10,null,1000,null,null,null,null,null,null,null,"X"]
[null,null,null,null,null,null,null,null,null,null,null,null,null,null,null,null,null,null,null,null,null,null,null,null,null,null,null,null,null,null,null,null,null,null,null,null,null,null,"X"]
[null,null,null,null,null,null,null,null,null,null,null,null,"Price List",null,null,null,null,null,null,null,"Cust. Cost",null,null,"Customer Cost Calculation",null,null,null,null,null,null,null,null,null,null,null,null,null,null,"X"]
[null,null,null,"Sizes & Shapes",null,null,null,null,null,null,null,null,"Full Carton",null,"Stock","Note",{"$f":"IF(Suggested=\"Yes\",Y11,AE11)","v":"List Price"},"U/M","Code",null,"Disc.","Net",null,"Chg","List Price","Disc","Act. Cost","GP%","Adj.","Group","Price",null,null,"Calc Price",".05 Round","Cents","Round to",null,"X"]
[null,null,null,null,null,null,null,null,null,null,null,null,null,null,null,null,null,null,null,null,null,null,null,null,null,null,null,null,null,null,null,null,null,null,null,null,null,null,"X"]
[null,null,null,null,null,null,null,null,null,null,null,null,{"$f":"\"File '\"&Instructions!B2&\"' - \"&Instructions!B1","v":"File 'A' - Ape"},null,null,null,null,null,null,null,"Cost",null,null,null,null,null,null,null,null,null,"Retail Price Calculations",null,null,null,null,null,null,null,"X"]
[null,null,null,null,null,null,null,null,null,null,null,null,null,null,null,null,null,{"$f":"+Instructions!B4","v":"5/1/23 (Updated)"},null,null,null,null,null,null,null,null,null,null,{"$f":"TODAY()","v":"2023-08-09"},null,null,null,null,null,null,null,null,null,"X"]
[null,null,null,null,null,null,null,null,null,null,null,null,null,null,null,null,null,null,null,null,null,null,null,null,null,null,null,null,null,null,null,null,null,null,null,null,null,null,"X"]
[null,null,{"$f":"\"Product Code '\"&Instructions!B3&\"'\"","v":"Product Code 'B'"},null,null,null,null,null,null,null,null,null,null,null,null,null,null,null,null,null,null,null,null,null,null,null,null,null,null,null,{"$f":"IF(Instructions!$C$8=\"\",\"\",Instructions!$C$8)","v":""},null,null,null,null,null,null,null,"X"]
[null,null,null,null,null,null,null,null,null,null,null,null,null,null,null,null,null,null,null,null,null,null,null,null,null,null,null,null,null,null,null,null,null,null,null,null,null,null,"X"]
[null,null,"Sizes & Shapes",null,null,null,null,null,null,null,null,null,"Full Carton",null,"Stock","Note",{"$f":"+Q$11","v":"List Price"},"U/M",{"$f":"+S$11","v":"Code"},null,"Disc.","Net",null,"Chg","List Price",{"$f":"+Z$11","v":"Disc"},"Act. Cost","GP%","Adj.",{"$f":"+AD$11","v":"Group"},"Price",null,null,"Calc Price",".05 Round","Cents","Round to",null,"X"]
[null,null,"ALL ITEMS MARKED WITH PACKAGING QUANTITY ARE SOLD IN MULTIPLES OF THAT QUANTITY ONLY",null,null,null,null,null,null,null,null,null,null,null,null,null,null,null,null,null,null,null,null,null,null,null,null,null,null,null,null,null,null,null,null,null,null,null,"X"]
[null,null,"NON-Stock ITEMS - MINIMUM 6-8 WEEK DELIVERY"]
[null,null,null,null,null,null,null,null,null,null,null,null,null,null,null,null,null,null,null,null,null,null,null,null,null,null,null,null,null,null,null,null,null,null,null,null,null,null,"X"]
[null,null,"ALTEA - Glazed Ceramic Wall",null,null,null,null,null,null,null,null,null,null,null,null,"Item # Lookup:","APAL"]
[null,null,"   ",null,null,null,null,null,null,null,null,null,null,null,null,null,null,null,null,null,null,null,null,null,null,null,null,null,null,null,null,null,null,null,null,null,null,null,"X"]
[null,null,null,"Colors:","Grey          Ivory          Sky          Taupe          White"]
[null,null,null,null,null,null,null,null,null,null,null,null,null,null,null,null,null,null,null,null,null,null,null,null,null,null,null,null,null,null,null,null,null,null,null,null,null,null,"X"]
[null,"Field Tile",null,"Gloss:","3\" x 12\"",null,"Field",null,null,null,null,null,null,"5.38 SF/CTN","Stock","a",{"$f":"IF(Suggested=\"Yes\",Y26,AE26)","v":7.8},"SF",{"$f":"+Instructions!$B$3","v":"B"},null,{"$f":"+Instructions!$C$22","v":0},{"$f":"ROUND($Y26*(1-U26)+0.004999,2)","v":7.8},null,"",7.8,{"$f":"+U26","v":0},{"$f":"+V26","v":7.8},{"$f":"(AE26-AA26)/AE26","v":0},null,1,{"$f":"SUM(AH26:AJ26)+AC26","v":7.8},null,null,{"$f":"ROUND(AA26/(1-VLOOKUP(AD26,Group,2,FALSE)),2)","v":7.8},{"$f":"IF(VLOOKUP(AD26,Group,5,FALSE)=\"YES\",VLOOKUP(ROUND(ROUND(AH26,1)-AH26,2),Round,2,FALSE)+VLOOKUP(AD26,Group,6,FALSE),0)","v":0},{"$f":"IF(VLOOKUP(AD26,Group,7,FALSE)=\"\",0,ROUND(AH26-0.04999,1)-AH26+AK26)","v":0},{"$f":"IF(VLOOKUP(AD26,Group,7,FALSE)=\"\",\"\",VLOOKUP(AD26,Group,7,FALSE))","v":""},null,"X"]
[null,null,null,null,null,null,null,null,null,null,null,null,null,null,null,null,null,null,null,null,null,null,null,null,null,null,null,null,null,null,null,null,null,null,null,null,null,null,"X"]
[null,"Decos",null,null,"0.6\" x 12\"",null,"Pencil Bullnose (Edge Stick)",null,null,null,null,null,null,null,"Stock",null,{"$f":"IF(Suggested=\"Yes\",Y28,AE28)","v":9.25},"EA",{"$f":"+Instructions!$B$3","v":"B"},null,{"$f":"+Instructions!$C$22","v":0},{"$f":"ROUND($Y28*(1-U28)+0.004999,2)","v":9.25},null,"",9.25,{"$f":"+U28","v":0},{"$f":"+V28","v":9.25},{"$f":"(AE28-AA28)/AE28","v":0},null,3,{"$f":"SUM(AH28:AJ28)+AC28","v":9.25},null,null,{"$f":"ROUND(AA28/(1-VLOOKUP(AD28,Group,2,FALSE)),2)","v":9.25},{"$f":"IF(VLOOKUP(AD28,Group,5,FALSE)=\"YES\",VLOOKUP(ROUND(ROUND(AH28,1)-AH28,2),Round,2,FALSE)+VLOOKUP(AD28,Group,6,FALSE),0)","v":0},{"$f":"IF(VLOOKUP(AD28,Group,7,FALSE)=\"\",0,ROUND(AH28-0.04999,1)-AH28+AK28)","v":0},{"$f":"IF(VLOOKUP(AD28,Group,7,FALSE)=\"\",\"\",VLOOKUP(AD28,Group,7,FALSE))","v":""},null,"X"]
[]
[null,null,null,"Note:","a) Packaging is changing from 5.38 SF/CTN to 10.76 SF/CTN as inventory with old packaging is depleted."]
[]
[null,null,"CALACATTA SLOW - Glazed Ceramic Wall & Glazed Porcelain Floor",null,null,null,null,null,null,null,null,null,null,null,null,"Item # Lookup:","APCS"]
[null,null,"   ",null,null,null,null,null,null,null,null,null,null,null,null,null,null,null,null,null,null,null,null,null,null,null,null,null,null,null,null,null,null,null,null,null,null,null,"X"]
[null,null,null,"Colors:","Calacatta Slow"]
[null,null,null,null,null,null,null,null,null,null,null,null,null,null,null,null,null,null,null,null,null,null,null,null,null,null,null,null,null,null,null,null,null,null,null,null,null,null,"X"]
[null,"Field Tile",null,null,"3\" x 12\"",null,"Field",null,null,null,null,null,null,"10.76 SF/CTN","Stock",null,{"$f":"IF(Suggested=\"Yes\",Y36,AE36)","v":7.8},"SF",{"$f":"+Instructions!$B$3","v":"B"},null,{"$f":"+Instructions!$C$22","v":0},{"$f":"ROUND($Y36*(1-U36)+0.004999,2)","v":7.8},null,"",7.8,{"$f":"+U36","v":0},{"$f":"+V36","v":7.8},{"$f":"(AE36-AA36)/AE36","v":0},null,1,{"$f":"SUM(AH36:AJ36)+AC36","v":7.8},null,null,{"$f":"ROUND(AA36/(1-VLOOKUP(AD36,Group,2,FALSE)),2)","v":7.8},{"$f":"IF(VLOOKUP(AD36,Group,5,FALSE)=\"YES\",VLOOKUP(ROUND(ROUND(AH36,1)-AH36,2),Round,2,FALSE)+VLOOKUP(AD36,Group,6,FALSE),0)","v":0},{"$f":"IF(VLOOKUP(AD36,Group,7,FALSE)=\"\",0,ROUND(AH36-0.04999,1)-AH36+AK36)","v":0},{"$f":"IF(VLOOKUP(AD36,Group,7,FALSE)=\"\",\"\",VLOOKUP(AD36,Group,7,FALSE))","v":""},null,"X"]
[null,"Field Tile",null,null,"5.5\" x 6.3\"",null,"Field - Hex",null,null,null,null,null,null,"3.55 SF/CTN","Stock","a",{"$f":"IF(Suggested=\"Yes\",Y37,AE37)","v":11.4},"SF",{"$f":"+Instructions!$B$3","v":"B"},null,{"$f":"+Instructions!$C$22","v":0},11.4,null,"",11.4,0,11.4,0,null,1,11.4,null,null,11.4,0,0,"",null,"X"]
[null,null,null,null,null,null,null,null,null,null,null,null,null,null,null,null,null,null,null,null,null,null,null,null,null,null,null,null,null,null,null,null,null,null,null,null,null,null,"X"]
[null,"Decos",null,null,"0.6\" x 12\"",null,"Pencil Bullnose (Edge Stick)",null,null,null,null,null,null,null,"Stock",null,{"$f":"IF(Suggested=\"Yes\",Y39,AE39)","v":9.25},"EA",{"$f":"+Instructions!$B$3","v":"B"},null,{"$f":"+Instructions!$C$22","v":0},9.25,null,"",9.25,0,9.25,0,null,3,9.25,null,null,9.25,0,0,"",null,"X"]
[]
[null,null,null,"Note:","a) Glazed Porcelain and may be used on floor applications."]
[]
[null,null,"CALPE - Glazed Ceramic Wall",null,null,null,null,null,null,null,null,null,null,null,null,"Item # Lookup:","APCA"]
[null,null,"   ",null,null,null,null,null,null,null,null,null,null,null,null,null,null,null,null,null,null,null,null,null,null,null,null,null,null,null,null,null,null,null,null,null,null,null,"X"]
[null,null,null,"Colors:","Grey          Ivory          Sky          Taupe          White"]
[null,null,null,null,null,null,null,null,null,null,null,null,null,null,null,null,null,null,null,null,null,null,null,null,null,null,null,null,null,null,null,null,null,null,null,null,null,null,"X"]
[null,"Field Tile",null,"Matte:","3\" x 12\"",null,"Field",null,null,null,null,null,null,"5.38 SF/CTN","Stock","a",{"$f":"IF(Suggested=\"Yes\",Y47,AE47)","v":7.8},"SF",{"$f":"+Instructions!$B$3","v":"B"},null,{"$f":"+Instructions!$C$22","v":0},{"$f":"ROUND($Y47*(1-U47)+0.004999,2)","v":7.8},null,"",7.8,{"$f":"+U47","v":0},{"$f":"+V47","v":7.8},{"$f":"(AE47-AA47)/AE47","v":0},null,1,{"$f":"SUM(AH47:AJ47)+AC47","v":7.8},null,null,{"$f":"ROUND(AA47/(1-VLOOKUP(AD47,Group,2,FALSE)),2)","v":7.8},{"$f":"IF(VLOOKUP(AD47,Group,5,FALSE)=\"YES\",VLOOKUP(ROUND(ROUND(AH47,1)-AH47,2),Round,2,FALSE)+VLOOKUP(AD47,Group,6,FALSE),0)","v":0},{"$f":"IF(VLOOKUP(AD47,Group,7,FALSE)=\"\",0,ROUND(AH47-0.04999,1)-AH47+AK47)","v":0},{"$f":"IF(VLOOKUP(AD47,Group,7,FALSE)=\"\",\"\",VLOOKUP(AD47,Group,7,FALSE))","v":""},null,"X"]
[null,null,null,null,null,null,null,null,null,null," ",null,null,null,null,null,null,null,null,null,null,null,null,null,null,null,null,null,null,null,null,null,null,null,null,null,null,null,"X"]
[null,"Decos",null,null,"0.6\" x 12\"",null,"Pencil Bullnose (Edge Stick)",null,null,null,null,null,null,null,"Stock",null,{"$f":"IF(Suggested=\"Yes\",Y49,AE49)","v":9.25},"EA",{"$f":"+Instructions!$B$3","v":"B"},null,{"$f":"+Instructions!$C$22","v":0},{"$f":"ROUND($Y49*(1-U49)+0.004999,2)","v":9.25},null,"",9.25,{"$f":"+U49","v":0},{"$f":"+V49","v":9.25},{"$f":"(AE49-AA49)/AE49","v":0},null,3,{"$f":"SUM(AH49:AJ49)+AC49","v":9.25},null,null,{"$f":"ROUND(AA49/(1-VLOOKUP(AD49,Group,2,FALSE)),2)","v":9.25},{"$f":"IF(VLOOKUP(AD49,Group,5,FALSE)=\"YES\",VLOOKUP(ROUND(ROUND(AH49,1)-AH49,2),Round,2,FALSE)+VLOOKUP(AD49,Group,6,FALSE),0)","v":0},{"$f":"IF(VLOOKUP(AD49,Group,7,FALSE)=\"\",0,ROUND(AH49-0.04999,1)-AH49+AK49)","v":0},{"$f":"IF(VLOOKUP(AD49,Group,7,FALSE)=\"\",\"\",VLOOKUP(AD49,Group,7,FALSE))","v":""},null,"X"]
[]
[null,null,null,"Note:","a) Packaging is changing from 5.38 SF/CTN to 10.76 SF/CTN as inventory with old packaging is depleted."]
[]
[null,null,"DYNAMIC - Glazed Ceramic Wall",null,null,null,null,null,null,null,null,null,null,null,null,"Item # Lookup:","APDY"]
[null,null,"   ",null,null,null,null,null,null,null,null,null,null,null,null,null,null,null,null,null,null,null,null,null,null,null,null,null,null,null,null,null,null,null,null,null,null,null,"X"]
[null,null,null,"Colors:","Celeste          Coral          Mostaza          Neutro          Pearl          Skylight"]
[null,null,null,null,null,null,null,null,null,null,null,null,null,null,null,null,null,null,null,null,null,null,null,null,null,null,null,null,null,null,null,null,null,null,null,null,null,null,"X"]
[null,"Field Tile",null,null,"3\" x 12\"",null,"Field",null,null,null,null,null,null,"5.38 SF/CTN","Stock","a",{"$f":"IF(Suggested=\"Yes\",Y57,AE57)","v":11.65},"SF",{"$f":"+Instructions!$B$3","v":"B"},null,{"$f":"+Instructions!$C$22","v":0},{"$f":"ROUND($Y57*(1-U57)+0.004999,2)","v":11.65},null,"",11.65,{"$f":"+U57","v":0},{"$f":"+V57","v":11.65},{"$f":"(AE57-AA57)/AE57","v":0},null,1,{"$f":"SUM(AH57:AJ57)+AC57","v":11.65},null,null,{"$f":"ROUND(AA57/(1-VLOOKUP(AD57,Group,2,FALSE)),2)","v":11.65},{"$f":"IF(VLOOKUP(AD57,Group,5,FALSE)=\"YES\",VLOOKUP(ROUND(ROUND(AH57,1)-AH57,2),Round,2,FALSE)+VLOOKUP(AD57,Group,6,FALSE),0)","v":0},{"$f":"IF(VLOOKUP(AD57,Group,7,FALSE)=\"\",0,ROUND(AH57-0.04999,1)-AH57+AK57)","v":0},{"$f":"IF(VLOOKUP(AD57,Group,7,FALSE)=\"\",\"\",VLOOKUP(AD57,Group,7,FALSE))","v":""},null,"X"]
[null,"Field Tile",null,null,"6\" x 7\" ",null,"Field - Scales (Escamas)",null,null,null,null,null,null,"5.38 SF/CTN","Stock","a",{"$f":"IF(Suggested=\"Yes\",Y58,AE58)","v":16.55},"SF",{"$f":"+Instructions!$B$3","v":"B"},null,{"$f":"+Instructions!$C$22","v":0},{"$f":"ROUND($Y58*(1-U58)+0.004999,2)","v":16.55},null,"",16.55,0,16.55,0,null,1,16.55,null,null,16.55,0,0,"",null,"X"]
[null,null,null,null,null,null,null,null,null,null,null,null,null,null,null,null,null,null,null,null,null,null,null,null,null,null,null,null,null,null,null,null,null,null,null,null,null,null,"X"]
[null,"Decos",null,null,"0.6\" x 12\"",null,"Pencil Bullnose (Edge Stick)",null,null,null,null,null,null,null,"Stock","a",{"$f":"IF(Suggested=\"Yes\",Y60,AE60)","v":9.25},"EA",{"$f":"+Instructions!$B$3","v":"B"},null,{"$f":"+Instructions!$C$22","v":0},{"$f":"ROUND($Y60*(1-U60)+0.004999,2)","v":9.25},null,"",9.25,{"$f":"+U60","v":0},{"$f":"+V60","v":9.25},{"$f":"(AE60-AA60)/AE60","v":0},null,3,{"$f":"SUM(AH60:AJ60)+AC60","v":9.25},null,null,{"$f":"ROUND(AA60/(1-VLOOKUP(AD60,Group,2,FALSE)),2)","v":9.25},{"$f":"IF(VLOOKUP(AD60,Group,5,FALSE)=\"YES\",VLOOKUP(ROUND(ROUND(AH60,1)-AH60,2),Round,2,FALSE)+VLOOKUP(AD60,Group,6,FALSE),0)","v":0},{"$f":"IF(VLOOKUP(AD60,Group,7,FALSE)=\"\",0,ROUND(AH60-0.04999,1)-AH60+AK60)","v":0},{"$f":"IF(VLOOKUP(AD60,Group,7,FALSE)=\"\",\"\",VLOOKUP(AD60,Group,7,FALSE))","v":""},null,"X"]
{"$rows_left_out":166}
{"sheet":"Websites","index":3,"n_rows":24,"n_cols":2,"rows_kept":24,"cut":false,"hidden":false,"merged":[]}
["Easy Access Website links"]
[]
["ConestogaTile's Website","https://www.conestogatile.com/"]
[]
["Manufacturer's Home Page","https://www.apegrupo.com/en/products/"]
[]
[]
["Product","Direct Website Link"]
["Altea","https://www.apegrupo.com/en/products/altea/"]
["Calpe","https://www.apegrupo.com/en/products/calpe/"]
["Calacatta Slow","https://www.apegrupo.com/en/products/calacatta-slow/"]
["Dynamic","https://www.apegrupo.com/en/products/dynamic/"]
["Fado","https://www.apegrupo.com/en/products/fado/"]
["Grunge","https://www.apegrupo.com/en/products/grunge/"]
["Hamptons","https://www.apegrupo.com/en/products/hamptons/"]
["Memories","https://www.apegrupo.com/en/products/memories/"]
["Murus","https://www.apegrupo.com/en/products/murus/"]
["Onyx Slow","https://www.apegrupo.com/en/products/onyx-slow/"]
["Savannah","https://www.apegrupo.com/en/products/savannah/"]
["Seville","https://www.apegrupo.com/en/products/seville/"]
["Switch","https://www.apegrupo.com/en/products/switch/"]
["Toscana","https://www.apegrupo.com/en/products/toscana/"]
["Verona","https://www.apegrupo.com/en/products/verona/"]
["Vintage","https://www.apegrupo.com/en/products/vintage/"]

{"sheet":"Changes","index":4,"n_rows":42,"n_cols":3,"rows_kept":42,"cut":false,"hidden":false,"merged":[[0,2,1,2]]}
["Date",null,"Description"]
["Announced","Series"]
[]
["New Products"]
["2020-07-01","Altea","Glazed Ceramic Wall"]
["2020-07-01","Calpe","Glazed Ceramic Wall"]
["2020-07-01","Dynamic","Glazed Ceramic Wall"]
["2020-07-01","Grunge","Glazed Ceramic Wall"]
["2020-07-01","Switch","Glazed Ceramic Wall"]
["2020-07-01","Vintage","Glazed Ceramic Wall"]
["2021-08-30","Fado","Glazed Ceramic Wall"]
["2021-08-30","Hamptons","Glazed Ceramic Wall"]
["2021-08-30","Memories","Glazed Ceramic Wall"]
["2021-08-30","Murus","Glazed Ceramic Wall"]
["2023-01-01","Calacatta Slow","Glazed Ceramic Wall & Glazed Porcelain Floor"]
["2023-01-01","Onyx Slow","Glazed Ceramic Wall & Glazed Porcelain Floor"]
["2023-01-01","Savannah","Glazed Ceramic Wall"]
["2023-01-01","Seville","Glazed Ceramic Wall"]
["2023-01-01","Toscana","Glazed Ceramic Wall"]
["2023-01-01","Verona","Glazed Ceramic Wall & Glazed Porcelain Floor"]
[]
[]
[]
[]
["Discontinued Products"]
["2023-04-06","Vintage","6\" x 6\" Field Tile format only in all colors."]
[]
[]
[]
[]
[]
[]
[]
[]
[]
[]
[]
[]
["Changes"]
["2023-03-28","Toscana","It has been learned that the tile in this series is a Glazed Porcelain.  The only place Ape does not recommend its installation is in very high traffic areas like malls etc.."]
["2023-05-19","Altea","The 3\" x 12\" Field Tile packaging is changing from 5.38 SF/CTN to 10.76 SF/CTN as inventory with old packaging is depleted."]
["2023-05-19","Murus","The 3\" x 11\" Field Tile packaging is changing from 10.55 SF/CTN to 6.35 SF/CTN as inventory with old packaging is depleted."]