{"text_format":"1","workbook":"xlsx","n_sheets":5,"sheets":["Instructions","Index","Price List","Websites","Changes"],"not_rendered":{"charts":0,"images":2,"macros":1,"external_links":0,"defined_names":18,"comments":0,"pivot_tables":0},"unopened":[],"bounds":{"document_bytes":16777216,"sheet_cells":100000,"rows_first":2000,"rows_last":500,"rows_between":2000,"halvings":0,"cell_chars":16384,"cell_head_chars":4096},"cells_cut":0,"cells_raw":0,"read":"whole","date_system":"1900"}

{"sheet":"Instructions","index":0,"n_rows":58,"n_cols":10,"rows_kept":58,"cut":false,"hidden":false,"merged":[[7,2,7,7],[36,3,36,4]]}
["Manufacturer","Roca Tile Group"]
["File as","R"]
["Product Code","G "]
["CCTD Effective Date","2/1/23 (Updated)"]
[]
[]
[]
["Enter your Company Name"]
[]
[null,"Click on \"Index\" to set the print area for the price list index"]
[null,"Then you can send it to print"]
[]
[]
[null,"Click on \"Suggested Price List\" to set the print area for Conestoga Tile's suggested price list."]
[null,"Then you can send it to print"]
[]
[]
[null,"Enter your discount codes if you want a personal net cost sheet."]
[]
[null,"Product"]
[null,"Code","Disc. %"]
[null,{"$f":"+B3","v":"G "}]
[]
[null,"Click on \"Your Cost\" to set the print area for your personal cost report."]
[null,"Then you can send it to print"]
[]
[]
["Discount: ","To help establish your price list, enter the gross profit percent for each type of product."]
[null,"If you want to use Conestoga Tile's list price, leave them blank."]
[]
["Round Nickel: ","If you always want your price to round to the nearest nickel, enter \"YES\"."]
[null,"If you enter \"NO\", it will NOT round to the nearest nickel."]
[]
["Ending Cents: ","If you always want your price to end with a certain cents, enter that cent value."]
[null,"If you leave it \"blank\" will NOT round to this cent value."]
[]
[null,"Group","GP Margin","GP Margin % for",null,"Round Nickel","add/subtract","Ending Cents"]
[null,1,null,"Field Tile",null,"No",0,null," "," "]
[null,2,null,"Trim",null,"No",0]
[null,3,null,"Decos",null,"No",0]
{"$rows_left_out":19}
{"sheet":"Index","index":1,"n_rows":56,"n_cols":20,"rows_kept":56,"cut":false,"hidden":false,"merged":[[55,0,55,11],[1,6,1,11],[4,0,4,11],[53,0,53,11]]}
[]
[null,null,null,null,null,null,{"$f":"\"File '\"&Instructions!B2&\"' - \"&Instructions!B1","v":"File 'R' - Roca Tile Group"}]
[]
[null,null,null,null,null,null,null,null,null,null,null,null," "]
[{"$f":"\"Price List Index - \"&Instructions!B4","v":"Price List Index - 2/1/23 (Updated)"}]
[]
[]
[]
[]
["Page",null,"Series",null,"Product Type",null,null,"Page",null,"Series",null,"Product Type"]
[1,null,"Abaco",null,"Color Body Porcelain",null,null,9,null,"Lithology Edition",null,"Glazed Porcelain"]
["1",null,"Abbey",null,"Color Body Porcelain",null,null,9,null,"Liverpool",null,"Glazed Porcelain"]
["1",null,"Alaska",null,"Polished Porcelain",null,null,9,null,"Magnolia",null,"Glazed Ceramic Wall"]
["1",null,"Artesano",null,"Glazed Ceramic Wall",null,null,10,null,"Maiolica",null,"Glazed Ceramic Wall"]
[1,null,"Bar Tile ",null,"Glazed Ceramic Wall",null,null,10,null,"Maiolica Floor",null,"Glazed Porcelain"]
[1,null,"Bianco Venatino",null,"Glazed Porcelain",null,null,10,null,"Marble Arcobaleno",null,"Color Body Porcelain"]
["1",null,"Block",null,"Glazed Porcelain",null,null,10,null,"Marble Lincoln",null,"Color Body Porcelain",null,null,null," "]
[1,null,"Block",null,"Glazed Ceramic Wall",null,null,10,null,"Marble Platinum",null,"Color Body Porcelain"]
[1,null,"Borneo Chevron",null,"Glazed Porcelain",null,null,10,null,"Metals",null,"Brushed Aluminum Mosaics"]
[1,null,"Brickell",null,"Glazed Ceramic Wall",null,null,11,null,"Momentum",null,"Glazed Porcelain"]
[2,null,"Calacatta Gold",null,"Glazed & Polished Porcelain",null,null,11,null,"Mystery",null,"Color Body Porcelain"]
[2,null,"Calacatta White",null,"Glazed Porcelain",null,null,11,null,"Nolita",null,"Color Body Porcelain"]
[2,null,"Carrara",null,"Glazed Porcelain",null,null,11,null,"Nordico",null,"Glazed Porcelain"]
[2,null,"Carve",null,"Glazed Porcelain",null,null,11,null,"Olaria",null,"Glazed Ceramic Wall"]
[2,null,"Casablanca",null,"Glazed Porcelain",null,null,11,null,"Ombre",null,"Glazed Ceramic Wall"]
[2,null,"CC Cosmos",null,"Glazed Porcelain",null,null,11,null,"Onyx",null,"Glazed & Polished Porcelain"]
[2,null,"CC Frames",null,"Glazed Porcelain",null,null,11,null,"Pavers",null,"2cm Porcelain Tile"]
["2-3",null,"CC Mosaics",null,"Glazed Porcelain Mosaics",null,null,11,null,"Piasentina",null,"Glazed Porcelain"]
[3,null,"CC Mosaics Plus+",null,"Glazed Porcelain Mosaics",null,null,11,null,"Pigment",null,"Color Body Porcelain",null,null,null," "]
[3,null,"CC Porcelain",null,"Unglazed Mosaics",null,null,12,null,"Positano",null,"Glazed Porcelain"]
["3-4",null,"CC Textures",null,"Glazed Ceramic Wall",null,null,12,null,"Pro",null,"Glazed Porcelain"]
[4,null,"Colonial",null,"Color Body Porcelain",null,null,12,null,"Pro Max",null,"Glazed Porcelain"]
["4-6",null,"Color Collection (Bright)",null,"Glazed Ceramic Wall",null,null,"12-13",null,"Rock Art",null,"Natural Stone"]
["6-7",null,"Color Collection (Matte)",null,"Glazed Ceramic Wall",null,null,13,null,"Seattle",null,"Glazed Porcelain"]
[7,null,"Crystal",null,"Polished Porcelain",null,null,13,null,"Slabs",null,"Glazed Porcelain"]
[7,null,"Decorative Accents",null,"Glazed Ceramic Wall",null,null,14,null,"St. Tropez",null,"Glazed Ceramic Wall"]
[8,null,"Dimensions (a.k.a. QUASAR)",null,"Glazed Ceramic Wall",null,null,14,null,"Statuary",null,"Glazed & Polished Porcelain",null,null,null,null," ",null,null," "]
[8,null,"Downtown",null,"Color Body Porcelain",null,null,14,null,"Statuary",null,"Glazed Ceramic Wall"]
[8,null,"Epoque",null,"Glazed Porcelain",null,null,14,null,"Stone Basel",null,"Color Body Porcelain"]
[8,null,"Everglade",null,"Glazed Porcelain",null,null,14,null,"Stone Basel",null,"Glazed Ceramic Wall"]
{"$rows_left_out":17}
{"sheet":"Price List","index":2,"n_rows":1410,"n_cols":41,"rows_kept":1410,"cut":false,"hidden":false,"merged":[[1399,3,1399,4],[9,14,9,19],[1393,2,1393,19],[17,14,17,15],[1395,2,1395,19],[18,2,18,19],[9,22,9,23],[12,14,12,19],[12,22,12,23],[9,25,9,32],[14,13,15,19],[10,14,10,15],[13,30,13,32]]}
[null,"Field Tile",null,null,"Size",null,"Field",null,null,null,null,null,null,null,null,"SF/CTN",null,null,{"$f":"IF(Suggested=\"Yes\",AA1,AG1)","v":0.05},"SF",{"$f":"+Instructions!$B$3","v":"G "},null,{"$f":"+Instructions!$C$22","v":0},{"$f":"ROUND($AA1*(1-W1)+0.004999,2)","v":0.05},null,"new",0.05,{"$f":"+W1","v":0},0.05,{"$f":"(AG1-AC1)/AG1","v":0},null,1,{"$f":"SUM(AJ1:AL1)+AE1","v":0.05},null,null,{"$f":"ROUND(AC1/(1-VLOOKUP(AF1,Group,2,FALSE)),2)","v":0.05},{"$f":"IF(VLOOKUP(AF1,Group,5,FALSE)=\"YES\",VLOOKUP(ROUND(ROUND(AJ1,1)-AJ1,2),Round,2,FALSE)+VLOOKUP(AF1,Group,6,FALSE),0)","v":0},{"$f":"IF(VLOOKUP(AF1,Group,7,FALSE)=\"\",0,ROUND(AJ1-0.04999,1)-AJ1+AM1)","v":0},{"$f":"IF(VLOOKUP(AF1,Group,7,FALSE)=\"\",\"\",VLOOKUP(AF1,Group,7,FALSE))","v":""},null,"X"]
[null,"Trim",null,null,"Size",null,"Shape",null,"Description",null,null,null,null,null,null,null,null,null,{"$f":"IF(Suggested=\"Yes\",AA2,AG2)","v":0.05},"EA",{"$f":"+Instructions!$B$3","v":"G "},null,{"$f":"+Instructions!$C$22","v":0},0.05,null,"new",0.05,0,0.05,0,null,2,0.05,null,null,0.05,0,0,"",null,"X"]
[null,"Decos",null,null,"Size",null,"Shape",null,"Description",null,null,null,null,null,null,null,null,null,{"$f":"IF(Suggested=\"Yes\",AA3,AG3)","v":0.05},"EA",{"$f":"+Instructions!$B$3","v":"G "},null,{"$f":"+Instructions!$C$22","v":0},0.05,null,"new",0.05,0,0.05,0,null,3,0.05,null,null,0.05,0,0,"",null,"X"]
[null,0,null,null,"Size",null,"Shape",null,"Description",null,null,null,null,null,null,null,null,null,{"$f":"IF(Suggested=\"Yes\",'Price List'!AA4,'Price List'!AG4)","v":0},"EA",{"$f":"+Instructions!$B$3","v":"G "},null,{"$f":"+Instructions!$C$22","v":0},0,null,"new",0,0,0,{"$error":"#DIV/0!"},null,4,0,null,null,0,0,0,"",null,"X"]
[null,0,null,null,"Size",null,"Shape",null,"Description",null,null,null,null,null,null,null,null,null,{"$f":"IF(Suggested=\"Yes\",'Price List'!AA5,'Price List'!AG5)","v":0},"EA",{"$f":"+Instructions!$B$3","v":"G "},null,{"$f":"+Instructions!$C$22","v":0},0,null,"new",0,0,0,{"$error":"#DIV/0!"},null,5,0,null,null,0,0,0,"",null,"X"]
[null,0,null,null,"Size",null,"Shape",null,"Description",null,null,null,null,null,null,null,null,null,{"$f":"IF(Suggested=\"Yes\",'Price List'!AA6,'Price List'!AG6)","v":0},"EA",{"$f":"+Instructions!$B$3","v":"G "},null,{"$f":"+Instructions!$C$22","v":0},0,null,"new",0,0,0,{"$error":"#DIV/0!"},null,6,0,null,null,0,0,0,"",null,"X"]
[null,0,null,null,"Size",null,"Shape",null,"Description",null,null,null,null,null,null,null,null,null,{"$f":"IF(Suggested=\"Yes\",'Price List'!AA7,'Price List'!AG7)","v":0},"EA",{"$f":"+Instructions!$B$3","v":"G "},null,{"$f":"+Instructions!$C$22","v":0},0,null,"new",0,0,0,{"$error":"#DIV/0!"},null,7,0,null,null,0,0,0,"",null,"X"]
[null,"Format",null,null,null,null,null,null,null,null,null,null,null,null,null,null,"Stock","a",1000,"ABC",null,null,0.1,1000,null,"ABC",1000,0.1,1000,0.1,10,null,1000,null,null,null,null,null,null,null,"X"]
[null,null,null,null,null,null,null,null,null,null,null,null,null,null,null,null,null,null,null,null,null,null,null,null,null,null,null,null,null,null,null,null,null,null,null,null,null,null,null,null,"X"]
[null,null,null,null,null,null,null,null,null,null,null,null,null,null,"Price List",null,null,null,null,null,null,null,"Cust. Cost",null,null,"Customer Cost Calculation",null,null,null,null,null,null,null,null,null,null,null,null,null,null,"X"]
[null,null,null,"Sizes & Shapes",null,null,null,null,null,null,null,null,null,null,"Full Carton",null,"Stock","Note",{"$f":"IF(Suggested=\"Yes\",AA11,AG11)","v":"List Price"},"U/M","Code",null,"Disc.","Net",null,"Chg","List Price","Disc","Act. Cost","GP%","Adj.","Group","Price",null,null,"Calc Price",".05 Round","Cents","Round to",null,"X"]
[null,null,null,null,null,null,null,null,null,null,null,null,null,null,null,null,null,null,null,null,null,null,null,null,null,null,null,null,null,null,null,null,null,null,null,null,null,null,null,null,"X"]
[null,null,null,null,null,null,null,null,null,null,null,null,null,null,{"$f":"\"File '\"&Instructions!B2&\"' - \"&Instructions!B1","v":"File 'R' - Roca Tile Group"},null,null,null,null,null,null,null,"Cost",null,null,null,null,null,null,null,null,null,"Retail Price Calculations",null,null,null,null,null,null,null,"X"]
[null,null,null,null,null,null,null,null,null,null,null,null,null,null,null,null,null,null,null,{"$f":"+Instructions!B4","v":"2/1/23 (Updated)"},null,null,null,null,null,null,null,null,null,null,{"$f":"TODAY()","v":"2023-05-17"},null,null,null,null,null,null,null,null,null,"X"]
[null,null,null,null,null,null,null,null,null,null,null,null,null,{"$f":"IF(Instructions!C8=\"\",\"\",+Instructions!C8)","v":""},null,null,null,null,null,null,null,null,null,null,null,null,null,null,null,null,null,null,null,null,null,null,null,null,null,null,"X"]
[null,null,{"$f":"\"Product Code '\"&Instructions!B3&\"'\"","v":"Product Code 'G '"},null,null,null,null,null," ",null,null,null,null,null,null,null,null,null,null,null,null,null,null,null,null,null,null,null,null,null,null,null,{"$f":"IF(Instructions!$C$8=\"\",\"\",Instructions!$C$8)","v":""},null,null,null,null,null,null,null,"X"]
[null,null,null,null,null,null,null,null,null,null,null,null,null,null,null,null,null,null,null,null,null,null,null,null,null,null,null,null,null,null,null,null,null,null,null,null,null,null,null,null,"X"]
[null,null,"Sizes & Shapes",null,null,null,null,null,null,null,null,null,null,null,"Full Carton",null,"Stock","Note",{"$f":"+S$11","v":"List Price"},"U/M",{"$f":"+U$11","v":"Code"},null,"Disc.","Net",null,"Chg","List Price",{"$f":"+AB$11","v":"Disc"},"Act. Cost","GP%","Adj.","Group","Price",null,null,{"$f":"+AJ$11","v":"Calc Price"},{"$f":"+AK$11","v":".05 Round"},{"$f":"+AL$11","v":"Cents"},{"$f":"+AM$11","v":"Round to"},null,"X"]
[null,null,"ALL ITEMS MARKED WITH PACKAGING QUANTITY ARE SOLD IN MULTIPLES OF THAT QUANTITY ONLY",null,null,null,null,null,null,null,null,null,null,null,null,null,null,null,null,null," ",null,null,null,null,null,null,null,null,null,null,null,null,null,null,null,null,null,null,null,"X"]
[null,null,null,null,null,null,null,null,null,null,null," ",null,null,null,null,null,null,null,null,null,null,null,null,null,null,null,null,null,null,null,null,null,null,null,null,null,null,null,null,"X"]
[null,null,"ABACO - Color Body Porcelain",null,null,null,null,null,null,null," "," ",null,null,null,null,null,"Item # Lookup:","ROAC",null,null,null,null,null,null,null,null,null,null,null,null,null,null,null,null,null,null,null,null,null,"X"]
[null,null,null,null,null,null,null,null,null,null,null,null,null,null,null,null,null,null,null,null,null,null,null,null,null,null,null,null,null,null,null,null,null,null,null,null,null,null,null,null,"X"]
[null,null,null,"Colors:","Arena          Grafito          Gris",null,null,null,null,null,null,null,null,null,null,null,null,null,null,null,null,null,null,null,null,null,null,null,null,null,null,null,null,null,null,null,null,null,null,null,"X"]
[null,null,null,null,null,null,null,null,null,null,null,null,null,null,null,null,null,null,null,null,null,null,null,null,null,null,null,null,null,null,null,null,null,null,null,null,null,null,null,null,"X"]
[null,"Field Tile",null,null,"12\" x 24\"",null,"Field",null,"Rectified",null,"Unpolished",null,null,null,null,"13.56 SF/CTN",null,"a",{"$f":"IF(Suggested=\"Yes\",AA25,AG25)","v":9.1},"SF",{"$f":"+Instructions!$B$3","v":"G "},null,{"$f":"+Instructions!$C$22","v":0},{"$f":"ROUND($AA25*(1-W25)+0.004999,2)","v":9.1},null,"YES",9.1,{"$f":"+W25","v":0},{"$f":"+X25","v":9.1},{"$f":"(AG25-AC25)/AG25","v":0},null,1,{"$f":"SUM(AJ25:AL25)+AE25","v":9.1},null,null,{"$f":"ROUND(AC25/(1-VLOOKUP(AF25,Group,2,FALSE)),2)","v":9.1},{"$f":"IF(VLOOKUP(AF25,Group,5,FALSE)=\"YES\",VLOOKUP(ROUND(ROUND(AJ25,1)-AJ25,2),Round,2,FALSE)+VLOOKUP(AF25,Group,6,FALSE),0)","v":0},{"$f":"IF(VLOOKUP(AF25,Group,7,FALSE)=\"\",0,ROUND(AJ25-0.04999,1)-AJ25+AM25)","v":0},{"$f":"IF(VLOOKUP(AF25,Group,7,FALSE)=\"\",\"\",VLOOKUP(AF25,Group,7,FALSE))","v":""},null,"X"]
[null,null,null,null,null,null,null,null,null,null,null,null,null,null,null,null,null,null,null,null,null,null,null,null,null,null,null,null,null,null,null,null,null,null,null,null,null,null,null,null,"X"]
[null,"Field Tile",null,null,"24\" x 48\"",null,"Field",null,"Rectified",null,"In&Out",null,null,null,null,"15.50 SF/CTN",null,"b,c",{"$f":"IF(Suggested=\"Yes\",AA27,AG27)","v":12.05},"SF",{"$f":"+Instructions!$B$3","v":"G "},null,{"$f":"+Instructions!$C$22","v":0},{"$f":"ROUND($AA27*(1-W27)+0.004999,2)","v":12.05},null,"YES",12.05,{"$f":"+W27","v":0},{"$f":"+X27","v":12.05},{"$f":"(AG27-AC27)/AG27","v":0},null,1,{"$f":"SUM(AJ27:AL27)+AE27","v":12.05},null,null,{"$f":"ROUND(AC27/(1-VLOOKUP(AF27,Group,2,FALSE)),2)","v":12.05},{"$f":"IF(VLOOKUP(AF27,Group,5,FALSE)=\"YES\",VLOOKUP(ROUND(ROUND(AJ27,1)-AJ27,2),Round,2,FALSE)+VLOOKUP(AF27,Group,6,FALSE),0)","v":0},{"$f":"IF(VLOOKUP(AF27,Group,7,FALSE)=\"\",0,ROUND(AJ27-0.04999,1)-AJ27+AM27)","v":0},{"$f":"IF(VLOOKUP(AF27,Group,7,FALSE)=\"\",\"\",VLOOKUP(AF27,Group,7,FALSE))","v":""},null,"X"]
[null,null,null,null,null,null,null,null,null,null,null,null,null,null,null,null,null,null,null,null,null,null,null,null,null,null,null,null,null,null,null,null,null,null,null,null,null,null,null,null,"X"]
[null,null,null,"Notes:","a) This format is going through a change of thickness.  Packaging is changing from 13.56 SF/CTN to 19.40 SF/CTN as inventory ",null,null,null,null,null,null,null,null,null,null,null,null,null,null,null,null,null,null,null,null,null,null,null,null,null,null,null,null,null,null,null,null,null,null,null,"X"]
[null,null,null,null,"with old packaging is depleted.  Check with Customer Service to be sure which packaging amount you will be receiving.",null,null,null,null,null,null,null,null,null,null,null,null,null,null,null,null,null,null,null,null,null,null,null,null,null,null,null,null,null,null,null,null,null,null,null,"X"]
[null,null,null,null,"b) This format is going through a change of thickness.  Packaging is changing from 15.50 SF/CTN to 23.25 SF/CTN as inventory ",null,null,null,null,null,null,null,null,null,null,null,null,null,null,null,null,null,null,null,null,null,null,null,null,null,null,null,null,null,null,null,null,null,null,null,"X"]
[null,null,null,null,"with old packaging is depleted.  Check with Customer Service to be sure which packaging amount you will be receiving.",null,null,null,null,null,null,null,null,null,null,null,null,null,null,null,null,null,null,null,null,null,null,null,null,null,null,null,null,null,null,null,null,null,null,null,"X"]
[null,null,null,null,"c) The In&Out finish provides a silky, and at the same time, slip resistant surface.",null,null,null,null,null,null,null,null,null,null,null,null,null,null,null,null,null,null,null,null,null,null,null,null,null,null,null,null,null,null,null,null,null,null,null,"X"]
[null,null,null,null,null,null,null,null,null,null,null,null,null,null,null,null,null,null,null,null,null,null,null,null,null,null,null,null,null,null,null,null,null,null,null,null,null,null,null,null,"X"]
[null,null,"ABBEY - Color Body Porcelain",null,null,null,null,null,null,null," "," ",null,null,null,null,null,"Item # Lookup:","ROAB",null,null,null,null,null,null,null,null,null,null,null,null,null,null,null,null,null,null,null,null,null,"X"]
[null,null,null,null,null,null,null,null,null,null,null,null,null,null,null,null,null,null,null,null,null,null,null,null,null,null,null,null,null,null,null,null,null,null,null,null,null,null,null,null,"X"]
[null,null,null,"Colors:","Fresno          Gris          Roble          Vison",null,null,null,null,null,null,null,null,null,null,null,null,null,null,null,null,null,null,null,null,null,null,null,null,null,null,null,null,null,null,null,null,null,null,null,"X"]
[null,null,null,null,null,null,null,null,null,null,null,null,null,null,null,null,null,null,null,null,null,null,null,null,null,null,null,null,null,null,null,null,null,null,null,null,null,null,null,null,"X"]
[null,"Field Tile",null,null,"8\" x 48\"",null,"Field",null,"Rectified",null,null,null,null,null,null,"10.08 SF/CTN",null,"a",{"$f":"IF(Suggested=\"Yes\",AA39,AG39)","v":9.25},"SF",{"$f":"+Instructions!$B$3","v":"G "},null,{"$f":"+Instructions!$C$22","v":0},{"$f":"ROUND($AA39*(1-W39)+0.004999,2)","v":9.25},null,"YES",9.25,{"$f":"+W39","v":0},{"$f":"+X39","v":9.25},{"$f":"(AG39-AC39)/AG39","v":0},null,1,{"$f":"SUM(AJ39:AL39)+AE39","v":9.25},null,null,{"$f":"ROUND(AC39/(1-VLOOKUP(AF39,Group,2,FALSE)),2)","v":9.25},{"$f":"IF(VLOOKUP(AF39,Group,5,FALSE)=\"YES\",VLOOKUP(ROUND(ROUND(AJ39,1)-AJ39,2),Round,2,FALSE)+VLOOKUP(AF39,Group,6,FALSE),0)","v":0},{"$f":"IF(VLOOKUP(AF39,Group,7,FALSE)=\"\",0,ROUND(AJ39-0.04999,1)-AJ39+AM39)","v":0},{"$f":"IF(VLOOKUP(AF39,Group,7,FALSE)=\"\",\"\",VLOOKUP(AF39,Group,7,FALSE))","v":""},null,"X"]
[null,"Field Tile",null,null,"8\" x 48\"",null,"Field",null,"Rectified",null,"Non-slip (ABS)",null,null,null,null,"20.13 SF/CTN",null,null,{"$f":"IF(Suggested=\"Yes\",AA40,AG40)","v":8.9499999999999993},"SF",{"$f":"+Instructions!$B$3","v":"G "},null,{"$f":"+Instructions!$C$22","v":0},{"$f":"ROUND($AA40*(1-W40)+0.004999,2)","v":8.9499999999999993},null,"YES",8.9499999999999993,{"$f":"+W40","v":0},{"$f":"+X40","v":8.9499999999999993},{"$f":"(AG40-AC40)/AG40","v":0},null,1,{"$f":"SUM(AJ40:AL40)+AE40","v":8.9499999999999993},null,null,{"$f":"ROUND(AC40/(1-VLOOKUP(AF40,Group,2,FALSE)),2)","v":8.9499999999999993},{"$f":"IF(VLOOKUP(AF40,Group,5,FALSE)=\"YES\",VLOOKUP(ROUND(ROUND(AJ40,1)-AJ40,2),Round,2,FALSE)+VLOOKUP(AF40,Group,6,FALSE),0)","v":0},{"$f":"IF(VLOOKUP(AF40,Group,7,FALSE)=\"\",0,ROUND(AJ40-0.04999,1)-AJ40+AM40)","v":0},{"$f":"IF(VLOOKUP(AF40,Group,7,FALSE)=\"\",\"\",VLOOKUP(AF40,Group,7,FALSE))","v":""},null,"X"]
{"$rows_left_out":1371}
{"sheet":"Websites","index":3,"n_rows":82,"n_cols":10,"rows_kept":82,"cut":false,"hidden":false,"merged":[]}
["Easy Access Website links"]
[]
["ConestogaTile's Website","www.conestogatile.com"]
[null,null,null,null," "]
["Manufacturer's Home Page","http://www.rocatilegroup.com/"]
[]
[]
["Product","Direct Website Link"]
["Abaco","https://rocatileusa.com/collections/abaco/"]
["Abbey","http://rocatileusa.com/collections/abbey/"]
["Alaska","https://rocatileusa.com/collections/alaska/"]
["Artesano"]
["Bar Tile"]
["Bianco Venatino","http://rocatilegroup.com/collections/bianco-venatino/"]
["Block","https://rocatileusa.com/collections/block/"]
["Borneo","http://rocatileusa.com/collections/borneo-wood-look-tile/"]
["Borneo Chevron","http://rocatileusa.com/collections/borneo-chevron/"]
["Brickell","http://rocatileusa.com/collections/brickell/"]
["Calacatta Gold","https://rocatileusa.com/collections/calacata-gold/"]
["Calacatta White","https://rocatileusa.com/collections/calacatta/"]
["Carrara","https://rocatileusa.com/collections/carrara/"]
["Carve","https://rocatileusa.com/collections/carve/"]
["Casablanca","http://rocatileusa.com/collections/casablanca/"]
["CC Cosmos"]
["CC Frames"]
["CC Mosaics","http://rocatilegroup.com/products/cc-porcelain-mosaics/"]
["CC Mosaics Plus+","http://rocatilegroup.com/products/cc-porcelain-mosaics-plus/"]
["CC Porcelain","http://rocatilegroup.com/products/porcelain-mosaics-cc/"]
["CC Textures","http://rocatileusa.com/collections/cc-textures/"]
["Colonial","https://rocatileusa.com/collections/colonial/"]
["Color Collection","http://rocatilegroup.com/color-collection-solid-color-wall-tile/"]
["Crystal","https://rocatileusa.com/collections/crystal/"]
["Decorative Accents","http://rocatilegroup.com/products/decorative-accent-wall-tile/"]
["Dimensions","https://rocatileusa.com/collections/dimensions/"]
["Downtown","http://rocatilegroup.com/products/downtown-concrete-look-tile/"]
["Epoque","https://rocatileusa.com/collections/epoque/"]
["Everglade","https://rocatileusa.com/collections/everglade/"]
["Feathers"]
["Flow","http://rocatileusa.com/collections/flow/"]
["Havana","http://rocatilegroup.com/collections/havana/"]
{"$rows_left_out":43}
{"sheet":"Changes","index":4,"n_rows":692,"n_cols":3,"rows_kept":692,"cut":false,"hidden":false,"merged":[]}
["Date"]
["Announced","Series","Description"]
[]
["New Products",null," "]
["2008-02-01","ALCAZAR"]
["2008-02-01","ARDESIA"]
["2008-02-01","BELLATERRA"]
["2008-09-03","ONDA"]
["2009-04-08","DOT-MOUNTED MOSAICS"]
["2010-01-22","Astral - Glazed Ceramic","Coordinating field, decoratives & trims for Laufen Alcazar Series."]
["2010-03-22","Argos","Unglazed Porcelain"]
["2010-03-22","Java","Glazed Ceramic"]
["2010-03-22","Monte Bello","Glazed Porcelain"]
["2010-03-22","Nordico","Glazed Ceramic"]
["2010-03-22","Avila","Through-Body Porcelain"]
["2010-03-22","Coral","Glass"]
["2010-03-22","Rock & Rock:  Montana","Unglazed Porcelain"]
["2010-03-22","Norway","Through-Body Porcelain"]
["2010-03-22","Stratos Orion","Through-Body Double Load Porcelain "]
["2010-03-22","Rock Art","Natural Stone"]
["2010-03-22","Rock & Rock:  Shellstone","Unglazed Porcelain"]
["2010-03-22","Stratos Artic","Through-Body Polished Porcelain"]
["2010-03-22","Stratos Atlas","Through-Body Polished Porcelain"]
["2010-03-22","Siros","Through-Body Polished Porcelain"]
["2011-07-07","Equinox","3\" x 6\" & 10\" x 13\" Field Tiles,  3\" x 10\" Willow Listello, 3\" x 6\" & 3\" x 10\" Bullnose."]
["2011-07-07","FRESNO","12\" x 12\" Floor & 3\" x 6\" Wall Field Tile, also, 3\" x 6\" Wall Bullnose."]
["2011-07-07","Marlin","Glazed Ceramic Floor & Wall"]
["2011-07-07","Arles","Glazed Porcelain"]
["2011-07-07","Coral","Added Beige-Olive Beroe 1\" x 1\" Multicolor Mosaic "]
["2011-07-07","Lavagna","Porcelain  "]
["2011-07-07","Packstone","Porcelain"]
["2011-07-07","STRATOS ARTIC","added 12\" x 24\" Field Tile "]
["2011-07-07","Stratos Orion","12\" x 12\" Field Tile & 3\" x 12\" Bullnose in both polished & unpolished, Taurus Mosaic."]
["2011-07-07","Tahiti","Glazed Porcelain"]
["2011-07-07","York","Porcelain"]
["2011-07-07","Norway","Through-Body Porcelain "]
["2011-07-07","Acadia","Glazed Porcelain"]
["2011-07-07","Astral - Glazed Ceramic","Added 10\"x13\" Wall, 3\"x10\" Willow Listello, 2\"x8\" Vancouver Listello & 3\"x10\" B/N."]
["2011-07-07","Bengala","Through-Body Porcelain"]
["2011-07-07","Color Collection","Added 4-1/4\" x 10\" field tile & 3\" x 10\" Bullnose in colors U081 White Ice & U281 White Ice.  Also added 4-1/4\" x 10\" field tile in colors U761 Tender Grey (Bright), U261 Tender Grey (Matte), U785 Fawn (Bright), U285 Fawn (Matte), U789 Taupe (Bright), U289 Taupe (Matte), U796 Cocoa (Bright), U296 Cocoa (Matte) and U759 Black (Bright).    "]
{"$rows_left_out":652}