{"text_format":"1","workbook":"xlsx","n_sheets":5,"sheets":["Instructions","Index","Price List","Websites","Changes"],"not_rendered":{"charts":0,"images":2,"macros":1,"external_links":0,"defined_names":18,"comments":0,"pivot_tables":0},"unopened":[],"bounds":{"document_bytes":16777216,"sheet_cells":100000,"rows_first":2000,"rows_last":500,"rows_between":2000,"halvings":0,"cell_chars":16384,"cell_head_chars":4096},"cells_cut":0,"cells_raw":0,"read":"whole","date_system":"1900"}

{"sheet":"Instructions","index":0,"n_rows":58,"n_cols":9,"rows_kept":58,"cut":false,"hidden":false,"merged":[[7,2,7,7],[36,3,36,4]]}
["Manufacturer","Fiandre"]
["File as","F"]
["Product Code","D"]
["CCTD Effective Date","10/1/22 (Updated)"]
[]
[]
[]
["Enter your Company Name"]
[]
[null,"Click on \"Index\" to set the print area for the price list index"]
[null,"Then you can send it to print"]
[]
[]
[null,"Click on \"Suggested Price List\" to set the print area for Conestoga Tile's suggested price list."]
[null,"Then you can send it to print"]
[]
[]
[null,"Enter your discount codes if you want a personal net cost sheet."]
[]
[null,"Product"]
[null,"Code","Disc. %"]
[null,{"$f":"+B3","v":"D"}]
[]
[null,"Click on \"Your Cost\" to set the print area for your personal cost report."]
[null,"Then you can send it to print"]
[]
[]
["Discount: ","To help establish your price list, enter the gross profit percent for each type of product."]
[null,"If you want to use Conestoga Tile's list price, leave them blank."]
[]
["Round Nickel: ","If you always want your price to round to the nearest nickel, enter \"YES\"."]
[null,"If you enter \"NO\", it will NOT round to the nearest nickel."]
[]
["Ending Cents: ","If you always want your price to end with a certain cents, enter that cent value."]
[null,"If you leave it \"blank\" will NOT round to this cent value."]
[]
[null,"Group","GP Margin","GP Margin % for",null,"Round Nickel","add/subtract","Ending Cents"]
[null,1,null,"Field Tile",null,"No",0,null," "]
[null,2,null,"Trim",null,"No",0]
[null,3,null,"Decos",null,"No",0]
{"$rows_left_out":19}
{"sheet":"Index","index":1,"n_rows":50,"n_cols":11,"rows_kept":50,"cut":false,"hidden":false,"merged":[[5,0,5,10],[47,0,47,10],[49,0,49,10],[2,5,2,10]]}
[]
[]
[null,null,null,null,null,{"$f":"\"File '\"&Instructions!B2&\"' - \"&Instructions!B1","v":"File 'F' - Fiandre"}]
[]
[]
[{"$f":"\"Price List Index - \"&Instructions!B4","v":"Price List Index - 10/1/22 (Updated)"}]
[]
[]
[]
[]
["Page",null,"Series",null,"Product Type",null,"Page",null,"Series",null,"Product Type"]
[1,null,"Core Shade",null,"Glazed Porcelain"]
[1,null,"Fahrenheit",null,"Glazed Porcelain"]
[1,null,"French Clay",null,"Glazed Porcelain Floor"]
[1,null,"French Clay (Discontinued 1/17/23)",null,"Glazed Ceramic Wall"]
[1,null,"LOL",null,"Glazed Ceramic Wall"]
[2,null,"Marble Lab",null,"Glazed Porcelain"]
["2-6",null,"Maximum",null,"Large Panel Porcelain"]
[6,null,"May",null,"Glazed Ceramic Wall"]
[6,null,"Royal Marble",null,"Glazed Porcelain"]
[6,null,"Shellstone",null,"Glazed Porcelain"]
[7,null,"Shen",null,"Glazed Porcelain"]
[7,null,"Unicolor (Discontinued 1/17/23)",null,"Glazed Porcelain"]
[]
[]
[]
[]
[]
[]
[]
[]
[]
[]
[]
[]
[]
[]
[]
[]
[]
{"$rows_left_out":11}
{"sheet":"Price List","index":2,"n_rows":629,"n_cols":42,"rows_kept":629,"cut":false,"hidden":false,"merged":[[11,14,11,15],[10,14,10,19],[618,3,618,4],[19,2,19,19],[18,14,18,15],[615,2,615,18],[185,3,185,18],[374,3,374,18],[613,2,613,19],[13,14,13,19],[15,13,16,19],[14,31,14,33],[13,23,13,24],[204,3,204,18],[453,3,453,18],[292,3,292,18],[10,23,10,24],[10,26,10,33]]}
[null,"Field Tile",null,null,"Size",null,"Field",null,null,null,null,null,null,null,null,"SF/CTN",null,null,{"$f":"IF(Suggested=\"Yes\",AB1,AH1)","v":0.05},"SF",{"$f":"+Instructions!$B$3","v":"D"},null,null,{"$f":"+Instructions!$C$22","v":0},{"$f":"ROUND($AB1*(1-X1)+0.004999,2)","v":0.05},null,"new",0.05,{"$f":"+X1","v":0},0.05,{"$f":"(AH1-AD1)/AH1","v":0},null,1,{"$f":"SUM(AK1:AM1)+AF1","v":0.05},null,null,{"$f":"ROUND(AD1/(1-VLOOKUP(AG1,Group,2,FALSE)),2)","v":0.05},{"$f":"IF(VLOOKUP(AG1,Group,5,FALSE)=\"YES\",VLOOKUP(ROUND(ROUND(AK1,1)-AK1,2),Round,2,FALSE)+VLOOKUP(AG1,Group,6,FALSE),0)","v":0},{"$f":"IF(VLOOKUP(AG1,Group,7,FALSE)=\"\",0,ROUND(AK1-0.04999,1)-AK1+AN1)","v":0},{"$f":"IF(VLOOKUP(AG1,Group,7,FALSE)=\"\",\"\",VLOOKUP(AG1,Group,7,FALSE))","v":""},null,"X"]
[null,"Trim",null,null,"Size",null,"Shape",null,"Description",null,null,null,null,null,null,null,null,null,0.05,"EA",{"$f":"+Instructions!$B$3","v":"D"},null,null,{"$f":"+Instructions!$C$22","v":0},0.05,null,"new",0.05,0,0.05,0,null,2,0.05,null,null,0.05,0,0,"",null,"X"]
[null,"Decos",null,null,"Size",null,"Shape",null,"Description",null,null,null,null,null,null,null,null,null,0.05,"EA",{"$f":"+Instructions!$B$3","v":"D"},null,null,{"$f":"+Instructions!$C$22","v":0},0.05,null,"new",0.05,0,0.05,0,null,3,0.05,null,null,0.05,0,0,"",null,"X"]
[null,"Stock - Field Tile",null,null,"Size",null,"Shape",null,"Description",null,null,null,null,null,null,"SF/CTN",null,null,0.05,"SF",{"$f":"+Instructions!$B$3","v":"D"},null,null,{"$f":"+Instructions!$C$22","v":0},0.05,null,"new",0.05,0,0.05,0,null,4,0.05,null,null,0.05,0,0,"",null,"X"]
[null,"Stock - Trim",null,null,"Size",null,"Shape",null,"Description",null,null,null,null,null,null,null,null,null,0.05,"EA",{"$f":"+Instructions!$B$3","v":"D"},null,null,{"$f":"+Instructions!$C$22","v":0},0.05,null,"new",0.05,0,0.05,0,null,5,0.05,null,null,0.05,0,0,"",null,"X"]
[null,"Stock - Decos",null,null,"Size",null,"Shape",null,"Description",null,null,null,null,null,null,null,null,null,0.05,"EA",{"$f":"+Instructions!$B$3","v":"D"},null,null,{"$f":"+Instructions!$C$22","v":0},0.05,null,"new",0.05,0,0.05,0,null,6,0.05,null,null,0.05,0,0,"",null,"X"]
[null,"Import - Field Tile",null,null,"Size",null,"Shape",null,"Description",null,null,null,null,null,null,null,null,null,{"$f":"IF(Suggested=\"Yes\",'Price List'!AB7,'Price List'!AH7)","v":0.05},"SF",{"$f":"+Instructions!$B$3","v":"D"},null,null,{"$f":"+Instructions!$C$22","v":0},0.05,null,"new",0.05,0,0.05,0,null,7,0.05,null,null,0.05,0,0,"",null,"X"]
[null,"Import - Deco & Trim",null,null,"Size",null,"Shape",null,"Description",null,null,null,null,null,null,null,null,null,{"$f":"IF(Suggested=\"Yes\",'Price List'!AB8,'Price List'!AH8)","v":0.05},"EA",{"$f":"+Instructions!$B$3","v":"D"},null,null,{"$f":"+Instructions!$C$22","v":0},{"$f":"ROUND($AB8*(1-X8)+0.004999,2)","v":0.05},null,"new",0.05,{"$f":"+X8","v":0},{"$f":"+Y8","v":0.05},{"$f":"(AH8-AD8)/AH8","v":0},null,7,{"$f":"SUM(AK8:AM8)+AF8","v":0.05},null,null,{"$f":"ROUND(AD8/(1-VLOOKUP(AG8,Group,2,FALSE)),2)","v":0.05},{"$f":"IF(VLOOKUP(AG8,Group,5,FALSE)=\"YES\",VLOOKUP(ROUND(ROUND(AK8,1)-AK8,2),Round,2,FALSE)+VLOOKUP(AG8,Group,6,FALSE),0)","v":0},{"$f":"IF(VLOOKUP(AG8,Group,7,FALSE)=\"\",0,ROUND(AK8-0.04999,1)-AK8+AN8)","v":0},{"$f":"IF(VLOOKUP(AG8,Group,7,FALSE)=\"\",\"\",VLOOKUP(AG8,Group,7,FALSE))","v":""},null,"X"]
[null,"Format",null,null,null,null,null,null,null,null,null,null,null,null,null,null,"Stock","a",1000,"ABC",null,null,null,0.1,1000,null,"ABC",1000,0.1,1000,0.1,10,null,1000,null,null,null,null,null,null,null,"X"]
[null,null,null,null,null,null,null,null,null,null,null,null,null,null,null,null,null,null,null,null,null,null,null,null,null,null,null,null,null,null,null,null,null,null,null,null,null,null,null,null,null,"X"]
[null,null,null,null,null,null,null,null,null,null,null,null,null,null,"Price List",null,null,null,null,null,null,null,null,"Cust. Cost",null,null,"Customer Cost Calculation",null,null,null,null,null,null,null,null,null,null,null,null,null,null,"X"]
[null,null,null,"Sizes & Shapes",null,null,null,null,null,null,null,null,null,null,"Full Carton",null,"Stock","Note",{"$f":"IF(Suggested=\"Yes\",AB12,AH12)","v":"List Price"},"U/M","Code",null,null,"Disc.","Net",null,"Chg","List Price","Disc","Act. Cost","GP%","Adj.","Group","Price",null,null,"Calc Price",".05 Round","Cents","Round to",null,"X"]
[null,null,null,null,null,null,null,null,null,null,null,null,null,null,null,null,null,null,null,null,null,null,null,null,null,null,null,null,null,null,null,null,null,null,null,null,null,null,null,null,null,"X"]
[null,null,null,null,null,null,null,null,null,null,null,null,null,null,{"$f":"\"File '\"&Instructions!B2&\"' - \"&Instructions!B1","v":"File 'F' - Fiandre"},null,null,null,null,null,null,null,null,"Cost",null,null,null,null,null,null,null,null,null,"Retail Price Calculations",null,null,null,null,null,null,null,"X"]
[null,null,null,null,null,null,null,null,null,null,null,null,null,null,null,null,null,null,null,{"$f":"+Instructions!B4","v":"10/1/22 (Updated)"},null,null,null,null,null,null,null,null,null,null,null,{"$f":"TODAY()","v":"2023-01-17"},null,null,null,null,null,null,null,null,null,"X"]
[null,null,null,null,null,null,null,null,null,null,null,null,null,{"$f":"IF(Instructions!C8=\"\",\"\",+Instructions!C8)","v":""},null,null,null,null,null,null,null,null,null,null,null,null,null,null,null,null,null,null,null,null,null,null,null,null,null,null,null,"X"]
[null,null,{"$f":"\"Product Code '\"&Instructions!B3&\"'\"","v":"Product Code 'D'"},null,null,null,null,null,null,null,null,null,null,null,null,null,null,null,null,null,null,null,null,null,null,null,null,null,null,null,null,null,null,{"$f":"IF(Instructions!$C$8=\"\",\"\",Instructions!$C$8)","v":""},null,null,null,null,null,null,null,"X"]
[null,null,null,null,null,null,null,null,null,null,null,null,null,null,null,null,null,null,null,null,null,null,null,null,null,null,null,null,null,null,null,null,null,null,null,null,null,null,null,null,null,"X"]
[null,null,"Sizes & Shapes",null,null,null,null,null,null,null,null,null,null,null,"Full Carton",null,"Stock","Note",{"$f":"+S$12","v":"List Price"},"U/M",{"$f":"+U$12","v":"Code"},null,null,"Disc.","Net",null,"Chg","List Price",{"$f":"+AC$12","v":"Disc"},"Act. Cost","GP%","Adj.",{"$f":"+AG$12","v":"Group"},"Price",null,null,"Calc Price",".05 Round","Cents","Round to",null,"X"]
[null,null,"ALL ITEMS MARKED WITH PACKAGING QUANTITY ARE SOLD IN MULTIPLES OF THAT QUANTITY ONLY",null,null,null,null,null,null,null,null,null,null,null,null,null,null,null,null,null,null,null,null,null,null,null,null,null,null,null,null,null,null,null,null,null,null,null,null,null,null,"X"]
[null,null,null,null,null,null,null,null,null,null,null," ",null,null,null,null,null,null,null,null,null,null,null,null,null,null,null,null,null,null,null,null,null,null,null,null,null,null,null,null,null,"X"]
[null,null,"CORE SHADE - Glazed Porcelain",null,null,null,null,null,null,null,null,null,null," ",null,null,null,"Item # Lookup:","FICS",null,null,null,null,null,null,null,null,null,null,null,null,null,null,null,null,null,null,null,null,null,null,"X"]
[]
[null,null,null,"Colors:","Ashy Core",null,"  Fawn Core",null,null,"Sharp Core",null,null,null,null,null,null,null,null,null,null,null,null,null,null,null,null,null,null,null,null,null,null,null,null,null,null,null,null,null,null,null,"X"]
[null,null,null,null,"Cloudy Core",null,"  Plain Core",null,null,"Snug Core",null,null,null,null,null,null,null,null,null,null,null,null,null,null,null,null,null,null,null,null,null,null,null,null,null,null,null,null,null,null,null,"X"]
[]
[null,"Stock - Field Tile",null,null,"12\" x 24\"",null,"Field",null,null,"Honed",null,null,null,null,null,"9.69 SF/CTN",null,"a",{"$f":"IF(Suggested=\"Yes\",AB27,AH27)","v":16.399999999999999},"SF",{"$f":"+Instructions!$B$3","v":"D"},null,null,{"$f":"+Instructions!$C$22","v":0},{"$f":"ROUND($AB27*(1-X27)+0.004999,2)","v":16.399999999999999},null,"",16.399999999999999,{"$f":"+X27","v":0},16.399999999999999,{"$f":"(AH27-AD27)/AH27","v":0},null,4,{"$f":"SUM(AK27:AM27)+AF27","v":16.399999999999999},null,null,{"$f":"ROUND(AD27/(1-VLOOKUP(AG27,Group,2,FALSE)),2)","v":16.399999999999999},{"$f":"IF(VLOOKUP(AG27,Group,5,FALSE)=\"YES\",VLOOKUP(ROUND(ROUND(AK27,1)-AK27,2),Round,2,FALSE)+VLOOKUP(AG27,Group,6,FALSE),0)","v":0},{"$f":"IF(VLOOKUP(AG27,Group,7,FALSE)=\"\",0,ROUND(AK27-0.04999,1)-AK27+AN27)","v":0},{"$f":"IF(VLOOKUP(AG27,Group,7,FALSE)=\"\",\"\",VLOOKUP(AG27,Group,7,FALSE))","v":""},null,"X"]
[null,"Field Tile",null,null,"24\" x 24\"",null,"Field",null,null,"Honed",null,null,null,null,null,"11.63 SF/CTN",null,"b",{"$f":"IF(Suggested=\"Yes\",AB28,AH28)","v":17.350000000000001},"SF",{"$f":"+Instructions!$B$3","v":"D"},null,null,{"$f":"+Instructions!$C$22","v":0},{"$f":"ROUND($AB28*(1-X28)+0.004999,2)","v":17.350000000000001},null,"",17.350000000000001,0,17.350000000000001,{"$f":"(AH28-AD28)/AH28","v":0},null,1,{"$f":"SUM(AK28:AM28)+AF28","v":17.350000000000001},null,null,{"$f":"ROUND(AD28/(1-VLOOKUP(AG28,Group,2,FALSE)),2)","v":17.350000000000001},{"$f":"IF(VLOOKUP(AG28,Group,5,FALSE)=\"YES\",VLOOKUP(ROUND(ROUND(AK28,1)-AK28,2),Round,2,FALSE)+VLOOKUP(AG28,Group,6,FALSE),0)","v":0},{"$f":"IF(VLOOKUP(AG28,Group,7,FALSE)=\"\",0,ROUND(AK28-0.04999,1)-AK28+AN28)","v":0},{"$f":"IF(VLOOKUP(AG28,Group,7,FALSE)=\"\",\"\",VLOOKUP(AG28,Group,7,FALSE))","v":""},null,"X"]
[null,"Field Tile",null,null,"24\" x 48\"",null,"Field",null,null,"Honed",null,null,null,null,null,"15.50 SF/CTN",null,"b",{"$f":"IF(Suggested=\"Yes\",AB29,AH29)","v":20.3},"SF",{"$f":"+Instructions!$B$3","v":"D"},null,null,{"$f":"+Instructions!$C$22","v":0},{"$f":"ROUND($AB29*(1-X29)+0.004999,2)","v":20.3},null,"",20.3,0,20.3,{"$f":"(AH29-AD29)/AH29","v":0},null,1,{"$f":"SUM(AK29:AM29)+AF29","v":20.3},null,null,{"$f":"ROUND(AD29/(1-VLOOKUP(AG29,Group,2,FALSE)),2)","v":20.3},{"$f":"IF(VLOOKUP(AG29,Group,5,FALSE)=\"YES\",VLOOKUP(ROUND(ROUND(AK29,1)-AK29,2),Round,2,FALSE)+VLOOKUP(AG29,Group,6,FALSE),0)","v":0},{"$f":"IF(VLOOKUP(AG29,Group,7,FALSE)=\"\",0,ROUND(AK29-0.04999,1)-AK29+AN29)","v":0},{"$f":"IF(VLOOKUP(AG29,Group,7,FALSE)=\"\",\"\",VLOOKUP(AG29,Group,7,FALSE))","v":""},null,"X"]
[]
[null,"Trim",null,null,"4\" x 24\"",null,"Bullnose",null,null,"Honed",null,null,null,null,null,"6 PCS/CTN",null,"a",{"$f":"IF(Suggested=\"Yes\",AB31,AH31)","v":38.9},"EA",{"$f":"+Instructions!$B$3","v":"D"},null,null,{"$f":"+Instructions!$C$22","v":0},{"$f":"ROUND($AB31*(1-X31)+0.004999,2)","v":38.9},null,"",38.9,{"$f":"+X31","v":0},{"$f":"+Y31","v":38.9},{"$f":"(AH31-AD31)/AH31","v":0},null,2,{"$f":"SUM(AK31:AM31)+AF31","v":38.9},null,null,{"$f":"ROUND(AD31/(1-VLOOKUP(AG31,Group,2,FALSE)),2)","v":38.9},{"$f":"IF(VLOOKUP(AG31,Group,5,FALSE)=\"YES\",VLOOKUP(ROUND(ROUND(AK31,1)-AK31,2),Round,2,FALSE)+VLOOKUP(AG31,Group,6,FALSE),0)","v":0},{"$f":"IF(VLOOKUP(AG31,Group,7,FALSE)=\"\",0,ROUND(AK31-0.04999,1)-AK31+AN31)","v":0},{"$f":"IF(VLOOKUP(AG31,Group,7,FALSE)=\"\",\"\",VLOOKUP(AG31,Group,7,FALSE))","v":""},null,"X"]
[]
[null,"Trim",null,null,"12\" x 24\"",null,"Stair Tread",null,null,"Honed",null,null,null,null,null,"5 PCS/CTN",null,"b",{"$f":"IF(Suggested=\"Yes\",AB33,AH33)","v":133.55000000000001},"EA",{"$f":"+Instructions!$B$3","v":"D"},null,null,{"$f":"+Instructions!$C$22","v":0},{"$f":"ROUND($AB33*(1-X33)+0.004999,2)","v":133.55000000000001},null,"",133.55000000000001,0,133.55000000000001,{"$f":"(AH33-AD33)/AH33","v":0},null,2,{"$f":"SUM(AK33:AM33)+AF33","v":133.55000000000001},null,null,{"$f":"ROUND(AD33/(1-VLOOKUP(AG33,Group,2,FALSE)),2)","v":133.55000000000001},{"$f":"IF(VLOOKUP(AG33,Group,5,FALSE)=\"YES\",VLOOKUP(ROUND(ROUND(AK33,1)-AK33,2),Round,2,FALSE)+VLOOKUP(AG33,Group,6,FALSE),0)","v":0},{"$f":"IF(VLOOKUP(AG33,Group,7,FALSE)=\"\",0,ROUND(AK33-0.04999,1)-AK33+AN33)","v":0},{"$f":"IF(VLOOKUP(AG33,Group,7,FALSE)=\"\",\"\",VLOOKUP(AG33,Group,7,FALSE))","v":""},null,"X"]
[]
[null,"Field Tile",null,null,"12\" x 24\"",null,"Field",null,null,"Slate",null,null,null,null,null,"9.69 SF/CTN",null,"b",{"$f":"IF(Suggested=\"Yes\",AB35,AH35)","v":17.899999999999999},"SF",{"$f":"+Instructions!$B$3","v":"D"},null,null,{"$f":"+Instructions!$C$22","v":0},{"$f":"ROUND($AB35*(1-X35)+0.004999,2)","v":17.899999999999999},null,"",17.899999999999999,{"$f":"+X35","v":0},17.899999999999999,{"$f":"(AH35-AD35)/AH35","v":0},null,1,{"$f":"SUM(AK35:AM35)+AF35","v":17.899999999999999},null,null,{"$f":"ROUND(AD35/(1-VLOOKUP(AG35,Group,2,FALSE)),2)","v":17.899999999999999},{"$f":"IF(VLOOKUP(AG35,Group,5,FALSE)=\"YES\",VLOOKUP(ROUND(ROUND(AK35,1)-AK35,2),Round,2,FALSE)+VLOOKUP(AG35,Group,6,FALSE),0)","v":0},{"$f":"IF(VLOOKUP(AG35,Group,7,FALSE)=\"\",0,ROUND(AK35-0.04999,1)-AK35+AN35)","v":0},{"$f":"IF(VLOOKUP(AG35,Group,7,FALSE)=\"\",\"\",VLOOKUP(AG35,Group,7,FALSE))","v":""},null,"X"]
[null,"Field Tile",null,null,"24\" x 24\"",null,"Field",null,null,"Slate",null,null,null,null,null,"11.63 SF/CTN",null,"b",{"$f":"IF(Suggested=\"Yes\",AB36,AH36)","v":18.8},"SF",{"$f":"+Instructions!$B$3","v":"D"},null,null,{"$f":"+Instructions!$C$22","v":0},{"$f":"ROUND($AB36*(1-X36)+0.004999,2)","v":18.8},null,"",18.8,0,18.8,{"$f":"(AH36-AD36)/AH36","v":0},null,1,{"$f":"SUM(AK36:AM36)+AF36","v":18.8},null,null,{"$f":"ROUND(AD36/(1-VLOOKUP(AG36,Group,2,FALSE)),2)","v":18.8},{"$f":"IF(VLOOKUP(AG36,Group,5,FALSE)=\"YES\",VLOOKUP(ROUND(ROUND(AK36,1)-AK36,2),Round,2,FALSE)+VLOOKUP(AG36,Group,6,FALSE),0)","v":0},{"$f":"IF(VLOOKUP(AG36,Group,7,FALSE)=\"\",0,ROUND(AK36-0.04999,1)-AK36+AN36)","v":0},{"$f":"IF(VLOOKUP(AG36,Group,7,FALSE)=\"\",\"\",VLOOKUP(AG36,Group,7,FALSE))","v":""},null,"X"]
[null,"Field Tile",null,null,"24\" x 48\"",null,"Field",null,null,"Slate",null,null,null,null,null,"15.50 SF/CTN",null,"b",{"$f":"IF(Suggested=\"Yes\",AB37,AH37)","v":21.7},"SF",{"$f":"+Instructions!$B$3","v":"D"},null,null,{"$f":"+Instructions!$C$22","v":0},{"$f":"ROUND($AB37*(1-X37)+0.004999,2)","v":21.7},null,"",21.7,0,21.7,{"$f":"(AH37-AD37)/AH37","v":0},null,1,{"$f":"SUM(AK37:AM37)+AF37","v":21.7},null,null,{"$f":"ROUND(AD37/(1-VLOOKUP(AG37,Group,2,FALSE)),2)","v":21.7},{"$f":"IF(VLOOKUP(AG37,Group,5,FALSE)=\"YES\",VLOOKUP(ROUND(ROUND(AK37,1)-AK37,2),Round,2,FALSE)+VLOOKUP(AG37,Group,6,FALSE),0)","v":0},{"$f":"IF(VLOOKUP(AG37,Group,7,FALSE)=\"\",0,ROUND(AK37-0.04999,1)-AK37+AN37)","v":0},{"$f":"IF(VLOOKUP(AG37,Group,7,FALSE)=\"\",\"\",VLOOKUP(AG37,Group,7,FALSE))","v":""},null,"X"]
[]
[null,"Trim",null,null,"4\" x 24\"",null,"Bullnose",null,null,"Slate",null,null,null,null,null,"6 PCS/CTN",null,"b",{"$f":"IF(Suggested=\"Yes\",AB39,AH39)","v":40.15},"EA",{"$f":"+Instructions!$B$3","v":"D"},null,null,{"$f":"+Instructions!$C$22","v":0},{"$f":"ROUND($AB39*(1-X39)+0.004999,2)","v":40.15},null,"",40.15,{"$f":"+X39","v":0},{"$f":"+Y39","v":40.15},{"$f":"(AH39-AD39)/AH39","v":0},null,2,{"$f":"SUM(AK39:AM39)+AF39","v":40.15},null,null,{"$f":"ROUND(AD39/(1-VLOOKUP(AG39,Group,2,FALSE)),2)","v":40.15},{"$f":"IF(VLOOKUP(AG39,Group,5,FALSE)=\"YES\",VLOOKUP(ROUND(ROUND(AK39,1)-AK39,2),Round,2,FALSE)+VLOOKUP(AG39,Group,6,FALSE),0)","v":0},{"$f":"IF(VLOOKUP(AG39,Group,7,FALSE)=\"\",0,ROUND(AK39-0.04999,1)-AK39+AN39)","v":0},{"$f":"IF(VLOOKUP(AG39,Group,7,FALSE)=\"\",\"\",VLOOKUP(AG39,Group,7,FALSE))","v":""},null,"X"]
[]
{"$rows_left_out":590}
{"sheet":"Websites","index":3,"n_rows":19,"n_cols":4,"rows_kept":19,"cut":false,"hidden":false,"merged":[]}
["Easy Access Website links"]
[]
["ConestogaTile's Website","www.conestogatile.com"]
[]
["Manufacturer's Home Page","http://www.granitifiandre.com/"]
[]
[]
["Product","Direct Website Link"]
["Core Shade","https://www.granitifiandre.com/porcelain-tile/core-shade"]
["Fahrenheit","https://www.granitifiandre.com/porcelain-tile/fahrenheit"]
["French Clay","http://www.granitifiandre.com/porcelain-tile/made-in-usa/french-clay/"]
["LOL"]
["Marble Lab","http://www.granitifiandre.com/porcelain-tile/marble-lab"]
["Maximum","http://www.granitifiandre.com/porcelain-tile/maximum/"]
["May"]
["Royal Marble","https://www.granitifiandre.com/porcelain-tile/royal-marble"]
["Shellstone","http://www.granitifiandre.com/porcelain-tile/made-in-usa/shellstone/",null,"  "]
["Shen","http://www.granitifiandre.com/porcelain-tile/made-in-usa/shen/"]
["Unicolor","http://www.granitifiandre.com/porcelain-tile/made-in-usa/uni-color/"]

{"sheet":"Changes","index":4,"n_rows":110,"n_cols":4,"rows_kept":110,"cut":false,"hidden":false,"merged":[]}
["Date"]
["Announced","Series","Description"]
[]
["New Products"]
["2014-12-24","Butcher Block","Glazed Porcelain"]
["2014-12-24","French Clay","Glazed Porcelain Floor"]
["2014-12-24","French Clay","Glazed Ceramic Wall"]
["2014-12-24","Link","Unglazed Porcelain"]
["2014-12-24","Metropolis","Glazed Porcelain"]
["2014-12-24","New Marmi","Unglazed Porcelain"]
["2014-12-24","New Stone","Unglazed Porcelain"]
["2014-12-24","Nihon","Glazed Porcelain"]
["2014-12-24","Origins","Unglazed Porcelain"]
["2014-12-24","Shellstone","Glazed Porcelain"]
["2014-12-24","Silk Road","Glazed Porcelain"]
["2014-12-24","Unicolor","Glazed Porcelain"]
["2015-06-29","Harmony","Glazed Porcelain"]
["2015-06-29","Maximum","Thin Porcelain"]
["2016-08-08","Designer Woods","Glazed Porcelain"]
["2016-08-08","G Stone","Unglazed Porcelain"]
["2016-08-08","Maze","Glazed Porcelain"]
["2016-08-08","New Marmi","12\" x 24\" Honed Brick Mosaic and 12\" x 12\" Honed Stair Tread added to series."]
["2016-08-08","Shellstone","Multicolor 1\" x 2\" Brick Random Mix Mosaic added to series."]
["2016-08-08","Silk Road","2\" x 2\" Mosaic added and is available in color Wild Silk only.  6\" x 12\" Cove Base added and is available in both Soft Silk and Wild Silk colors. "]
["2017-05-31","Approach","Glazed Porcelain"]
["2017-05-31","Desire","Glazed Porcelain Floor & Glazed Ceramic Wall"]
["2017-05-31","LOL","Glazed Ceramic Wall"]
["2017-05-31","Marble Lab","Glazed Porcelain"]
["2017-05-31","Maximum","New Marmi colors added and are available in select formats:  Marmi Calacatta Elite, Marmi Calacatta Light, Marmi Glam Bronze, Marmi Pietra Grey, Marmi Premium White, Marmi Premium White A, Marmi Premium White B and Marmi Quarzo Greige.  Pre-polished finish added to Mega and HG. Resin colors in select formats.  Colors Agata Azzurra B, C, E & G and Frapuccino A, B, C & D added to the Precious Stones Colors."]
["2017-05-31","MAY","Glazed Ceramic Wall"]
["2017-05-31","Tao","Glazed Porcelain"]
["2017-05-31","Westloop","Glazed Porcelain"]
["2018-06-07","Dwood 2.0","Glazed Porcelain"]
["2018-06-07","Maximum","Colors Eminent Wood Brown, Eminent Wood Grey and Dark Marquina added."]
["2018-06-07","Tao","9\" x 36\" and 18\" x 36\" Field Tile formats added in both Honed and Semi-Polished finishes.  (Replacing the 8\" x 48\" and 24\" x 48\" Field Tile formats.)  Color Black added and is available in all formats."]
["2019-06-27","Maximum","Colors Eminent Wood Brown, Eminent Wood Grey, Marmi Glam Bronze and Marmi Pietra Grey now available in the Satin finish."]
["2019-06-27","Royal Marble","Glazed Porcelain, available in both 6mm and 8mm thicknesses."]
["2020-09-11","Core Shade","Glazed Porcelain."]
["2020-09-11","Fahrenheit","Glazed Porcelain."]
["2020-09-11","Marble Lab","Colors Atlantic Grey and Nero Marquina added to series."]
{"$rows_left_out":70}