{"text_format":"1","workbook":"xlsx","n_sheets":5,"sheets":["Instructions","Index","Price List","Websites","Updates"],"not_rendered":{"charts":0,"images":1,"macros":1,"external_links":0,"defined_names":19,"comments":0,"pivot_tables":0},"unopened":[],"bounds":{"document_bytes":16777216,"sheet_cells":100000,"rows_first":2000,"rows_last":500,"rows_between":2000,"halvings":0,"cell_chars":16384,"cell_head_chars":4096},"cells_cut":0,"cells_raw":0,"read":"whole","date_system":"1900"}

{"sheet":"Instructions","index":0,"n_rows":79,"n_cols":7,"rows_kept":79,"cut":false,"hidden":false,"merged":[[8,2,8,6]]}
["Manufacturer","Tools"]
["File as","T"]
["Product Code","N"]
["CCTD Effective Date","2/1/22"]
[]
[]
[]
[]
["Enter your Company Name"]
[]
[null,"Click on \"Index\" to set the print area for the price list index"]
[null,"Then you can send it to print"]
[]
[]
[null,"Click on \"Suggested Price List\" to set the print area for Conestoga Tile's suggested price list."]
[null,"Then you can send it to print"]
[]
[]
[null,"Enter your discount codes if you want a personal net cost sheet."]
[]
[null,null,"Product"]
[null,null,"Code","Disc. %"]
[null,null,{"$f":"+B3","v":"N"},0,"  This is a \"NET\" price list.  0% is the discount for this spreadsheet"]
[]
[null,"Click on \"Your Cost\" to set the print area for your personal cost report."]
[null,"Then you can send it to print"]
[]
[]
["Discount: ","To help establish your price list, enter the gross profit percent for each type of product."]
[null,"If you want to use Conestoga Tile's list price, leave them blank."]
[]
["Round Nickel: ","If you always want your price to round to the nearest nickel, enter \"YES\"."]
[null,"If you enter \"NO\", it will NOT round to the nearest nickel."]
[]
["Ending Cents: ","If you always want your price to end with a certain cents, enter that cent value."]
[null,"If you leave it \"blank\" will NOT round to this cent value."]
[]
[null,"GP Margin % for","Group","GP Margin","Round Nickel","add/subtract","Ending Cents"]
[null,"Barwalt - Saws/Cutters","PR1",null,"No",0]
[null,"Barwalt - All Other","PR",null,"No",0]
{"$rows_left_out":40}
{"sheet":"Index","index":1,"n_rows":50,"n_cols":9,"rows_kept":50,"cut":false,"hidden":false,"merged":[[5,0,5,10],[47,0,47,10],[49,0,49,10],[2,5,2,10],[3,4,3,7],[10,2,10,4],[10,8,10,10]]}
[]
[]
[null,null,null,null,null,{"$f":"\"File '\"&Instructions!B2&\"' - \"&Instructions!B1","v":"File 'T' - Tools"}]
[]
[]
[{"$f":"\"Price List Index - \"&Instructions!B4","v":"Price List Index - 2/1/22"}]
[]
[]
[]
[]
["Page",null,"Product Type",null,null,null,"Page",null,"Product Type"]
[]
[]
[]
[]
[]
[]
[]
[]
[]
[]
[]
[]
[]
[]
[]
[]
[]
[]
[]
[]
[]
[]
[]
[]
[]
[]
[]
[]
[]
{"$rows_left_out":11}
{"sheet":"Price List","index":2,"n_rows":439,"n_cols":41,"rows_kept":439,"cut":false,"hidden":false,"merged":[[3,22,3,23],[4,22,4,23],[3,14,3,19],[4,30,4,32],[428,3,428,4],[423,2,423,19],[8,2,8,4],[421,2,421,18],[9,2,9,18],[10,2,10,18],[8,14,8,15],[355,2,355,18],[207,18,208,18]]}
[null,{"$error":"#N/A"},null,"Our Part #",null,"Description",null,null,null,null,null,null,null,null,"Mfg.",null,null,null,{"$f":"IF(Suggested=\"Yes\",'Price List'!AA1,'Price List'!AG1)","v":{"$error":"#N/A"}},"EA",{"$f":"+Instructions!$B$3","v":"N"},null,{"$f":"+Instructions!$D$23","v":0},{"$f":"ROUND($AA1*(1-W1)+0.004999,2)","v":{"$error":"#N/A"}},null,"new",{"$error":"#N/A"},{"$f":"+W1","v":0},{"$f":"+X1","v":{"$error":"#N/A"}},{"$f":"(AG1-AC1)/AG1","v":{"$error":"#N/A"}},null,{"$f":"+A1","v":0},{"$f":"SUM(AJ1:AL1)+AE1","v":{"$error":"#N/A"}},null,null,{"$f":"ROUND(AC1/(1-VLOOKUP(AF1,Group,2,FALSE)),2)","v":{"$error":"#N/A"}},{"$f":"IF(VLOOKUP(AF1,Group,3,FALSE)=\"YES\",VLOOKUP(ROUND(ROUND(AJ1,1)-AJ1,2),Round,2,FALSE)+VLOOKUP(AF1,Group,4,FALSE),0)","v":{"$error":"#N/A"}},{"$f":"IF(VLOOKUP(AF1,Group,5,FALSE)=\"\",0,ROUND(AJ1-0.04999,1)-AJ1+AM1)","v":{"$error":"#N/A"}},{"$f":"IF(VLOOKUP(AF1,Group,5,FALSE)=\"\",\"\",VLOOKUP(AF1,Group,5,FALSE))","v":{"$error":"#N/A"}},null,"X"]
[null,"Format",null,null,null,null,null,null,null,null,null,null,null,null,null,null,"Stock","a",1000,"ABC",null,null,0.1,1000,null,"ABC",1000,0.1,1000,0.1,10,null,1000,null,null,null,null,null,null,null,"X"]
[null,null,null,null,null,null,null,null,null,null,null,null,null,null,null,null,null,null,null,null,null,null,null,null,null,null,null,null,null,null,null,null,null,null,null,null,null,null,null,null,"X"]
[null,null,null,null,null,null,null,null,null,null,null,null,null,null,{"$f":"\"File '\"&Instructions!B2&\"' - \"&Instructions!B1","v":"File 'T' - Tools"},null,null,null,null,null,null,null,null,null,null,null,null,null,null,null,null,null,"Retail Price Calculations",null,null,null,null,null,null,null,"X"]
[null,null,null,null,null,null,null,null,null,null,null,null,null,null,null,null,null,null,null,{"$f":"+Instructions!B4","v":"2/1/22"},null,null,"Cost",null,null,null,null,null,null,null,{"$f":"TODAY()","v":"2023-01-05"},null,null,null,null,null,null,null,null,null,"X"]
[null,null,{"$f":"\"Product Code '\"&Instructions!B3&\"'\"","v":"Product Code 'N'"},null,null,null,null,null,null,null,null,null,null,null,null,null,null,null,null,null,null,null,null,null,null,null,null,null,null,null,null,null,null,null,null,null,null,null,null,null,"X"]
[null,null,null,null,null,null,null,null,null,null,null,null,null,null,null,null,null,null,null,null,null,null,null,null,null,null,null,null,null,null,null,null,null,null,null,null,null,null,null,null,"X"]
[null,null,null,null,null,null,null,null,null,null,null,null,null,null,null,null,null,null,null,null,null,null,null,null,null,null,null,null,null,null,null,null,null,null,null,null,null,null,null,null,"X"]
[null,null,"Part Number",null,null,"Description",null,null,null,null,null,null,null,null,"Manufacturer",null,"Stock","Note","Net Price","U/M","Code",null,"Disc.","Net",null,"Chg","Net Price","Disc","Act. Cost","GP%","Adj.","Group","Price",null,null,"Calc Price",".05 Round","Cents","Round to",null,"X"]
[null,null,"Pricing is subject to change without notice.",null,null,null,null,null,null,null,null,null,null,null,null,null,null,null,null,null,null,null,null,null,null,null,null,null,null,null,null,null,null,null,null,null,null,null,null,null,"X"]
[null,null,"PRICING LISTED IS NET PRICING.  TRADE DISCOUNTS DO NOT APPLY.",null,null,null,null,null,null,null,null,null,null,null,null,null,null,null,null,null,null,null,null,null,null,null,null,null,null,null,null,null,null,null,null,null,null,null,null,null,"X"]
[null,null,null,null,null,null,null,null,null,null,null,null,null,null,null,null,null,null,null,null,null,null,null,null,null,null,null,null,null,null,null,null,null,null,null,null,null,null,null,null,"X"]
[null,null,"Trowels",null,null,null,null,null,null,null,null,null,null,null,null,null,null,null,null,null,null,null,null,null,null,null,null,null,null,null,null,null,null,null,null,null,null,null,null,null,"X"]
[null,null,null,null,null,null,null,null,null,null,null,null,null,null,null,null,null,null,null,null,null,null,null,null,null,null,null,null,null,null,null,null,null,null,null,null,null,null,null,null,"X"]
[null,null,null,"U-Notched - Trowels",null,null,null,null,null,null,null,null,null,null,null,null,null,null,null,null,null,null,null,null,null,null,null,null,null,null,null,null,null,null,null,null,null,null,null,null,"X"]
["PR","Barwalt - All Other",null,"PR71073",null,"1/4 x 1/4",null,"71073 #72",null,"- Soft Grip",null,null,null,null,"Barwalt",null,"Stock",null,{"$f":"IF(Suggested=\"Yes\",'Price List'!AA16,'Price List'!AG16)","v":10.85},"EA",{"$f":"+Instructions!$B$3","v":"N"},null,{"$f":"+Instructions!$D$23","v":0},{"$f":"ROUND($AA16*(1-W16)+0.004999,2)","v":10.85},null,"YES",10.85,{"$f":"+W16","v":0},{"$f":"+X16","v":10.85},{"$f":"(AG16-AC16)/AG16","v":0},null,{"$f":"+A16","v":"PR"},{"$f":"SUM(AJ16:AL16)+AE16","v":10.85},null,null,{"$f":"ROUND(AC16/(1-VLOOKUP(AF16,Group,2,FALSE)),2)","v":10.85},{"$f":"IF(VLOOKUP(AF16,Group,3,FALSE)=\"YES\",VLOOKUP(ROUND(ROUND(AJ16,1)-AJ16,2),Round,2,FALSE)+VLOOKUP(AF16,Group,4,FALSE),0)","v":0},{"$f":"IF(VLOOKUP(AF16,Group,5,FALSE)=\"\",0,ROUND(AJ16-0.04999,1)-AJ16+AM16)","v":0},{"$f":"IF(VLOOKUP(AF16,Group,5,FALSE)=\"\",\"\",VLOOKUP(AF16,Group,5,FALSE))","v":""},null,"X"]
[null,null,null,null,null,null,null,null,null,null,null,null,null,null,null,null,null,null,null,null,null,null,null,null,null,null,null,null,null,null,null,null,null,null,null,null,null,null,null,null,"X"]
["TR","Troxell - All Other",null,"TX14-66SS",null,"3/8 x 1/4",null,"14-66SS",null,"- Soft Grip, Stainless Steel",null,null,null,null,"Troxell",null,"Stock","New",{"$f":"IF(Suggested=\"Yes\",'Price List'!AA18,'Price List'!AG18)","v":13.15},"EA",{"$f":"+Instructions!$B$3","v":"N"},null,{"$f":"+Instructions!$D$23","v":0},{"$f":"ROUND($AA18*(1-W18)+0.004999,2)","v":13.15},null,"new",13.15,{"$f":"+W18","v":0},13.15,{"$f":"(AG18-AC18)/AG18","v":0},null,{"$f":"+A18","v":"TR"},{"$f":"SUM(AJ18:AL18)+AE18","v":13.15},null,null,{"$f":"ROUND(AC18/(1-VLOOKUP(AF18,Group,2,FALSE)),2)","v":13.15},{"$f":"IF(VLOOKUP(AF18,Group,3,FALSE)=\"YES\",VLOOKUP(ROUND(ROUND(AJ18,1)-AJ18,2),Round,2,FALSE)+VLOOKUP(AF18,Group,4,FALSE),0)","v":0},{"$f":"IF(VLOOKUP(AF18,Group,5,FALSE)=\"\",0,ROUND(AJ18-0.04999,1)-AJ18+AM18)","v":0},{"$f":"IF(VLOOKUP(AF18,Group,5,FALSE)=\"\",\"\",VLOOKUP(AF18,Group,5,FALSE))","v":""},null,"X"]
[null,null,null,null,null,null,null,null,null,null,null,null,null,null,null,null,null,null,null,null,null,null,null,null,null,null,null,null,null,null,null,null,null,null,null,null,null,null,null,null,"X"]
["PR","Barwalt - All Other",null,"PR71080",null,"1/2 x 1/4",null,"71080 #78",null,"- Soft Grip",null,null,null,null,"Barwalt",null,"Stock",null,{"$f":"IF(Suggested=\"Yes\",'Price List'!AA20,'Price List'!AG20)","v":10.85},"EA",{"$f":"+Instructions!$B$3","v":"N"},null,{"$f":"+Instructions!$D$23","v":0},{"$f":"ROUND($AA20*(1-W20)+0.004999,2)","v":10.85},null,"YES",10.85,{"$f":"+W20","v":0},{"$f":"+X20","v":10.85},{"$f":"(AG20-AC20)/AG20","v":0},null,{"$f":"+A20","v":"PR"},{"$f":"SUM(AJ20:AL20)+AE20","v":10.85},null,null,{"$f":"ROUND(AC20/(1-VLOOKUP(AF20,Group,2,FALSE)),2)","v":10.85},{"$f":"IF(VLOOKUP(AF20,Group,3,FALSE)=\"YES\",VLOOKUP(ROUND(ROUND(AJ20,1)-AJ20,2),Round,2,FALSE)+VLOOKUP(AF20,Group,4,FALSE),0)","v":0},{"$f":"IF(VLOOKUP(AF20,Group,5,FALSE)=\"\",0,ROUND(AJ20-0.04999,1)-AJ20+AM20)","v":0},{"$f":"IF(VLOOKUP(AF20,Group,5,FALSE)=\"\",\"\",VLOOKUP(AF20,Group,5,FALSE))","v":""},null,"X"]
["PR","Barwalt - All Other",null,"PR70962",null,"1/2 x 1/4",null,"70962 #78",null,"- Soft Grip, Stainless Steel",null,null,null,null,"Barwalt",null,"Stock",null,{"$f":"IF(Suggested=\"Yes\",'Price List'!AA21,'Price List'!AG21)","v":12.35},"EA",{"$f":"+Instructions!$B$3","v":"N"},null,{"$f":"+Instructions!$D$23","v":0},{"$f":"ROUND($AA21*(1-W21)+0.004999,2)","v":12.35},null,"YES",12.35,{"$f":"+W21","v":0},{"$f":"+X21","v":12.35},{"$f":"(AG21-AC21)/AG21","v":0},null,{"$f":"+A21","v":"PR"},{"$f":"SUM(AJ21:AL21)+AE21","v":12.35},null,null,{"$f":"ROUND(AC21/(1-VLOOKUP(AF21,Group,2,FALSE)),2)","v":12.35},{"$f":"IF(VLOOKUP(AF21,Group,3,FALSE)=\"YES\",VLOOKUP(ROUND(ROUND(AJ21,1)-AJ21,2),Round,2,FALSE)+VLOOKUP(AF21,Group,4,FALSE),0)","v":0},{"$f":"IF(VLOOKUP(AF21,Group,5,FALSE)=\"\",0,ROUND(AJ21-0.04999,1)-AJ21+AM21)","v":0},{"$f":"IF(VLOOKUP(AF21,Group,5,FALSE)=\"\",\"\",VLOOKUP(AF21,Group,5,FALSE))","v":""},null,"X"]
[null,null,null,null,null,null,null,null,null,null,null,null,null,null,null,null,null,null,null,null,null,null,null,null,null,null,null,null,null,null,null,null,null,null,null,null,null,null,null,null,"X"]
[null,null,null,"Square Notched - Trowels",null,null,null,null,null,null,null,null,null,null,null,null,null,null,null,null,null,null,null,null,null,null,null,null,null,null,null,null,null,null,null,null,null,null,null,null,"X"]
[null,null,null,null,null,null,null,null,null,null,null,null,null,null,null,null,null,null,null,null,null,null,null,null,null,null,null,null,null,null,null,null,null,null,null,null,null,null,null,null,"X"]
["PR","Barwalt - All Other",null,"PR71138",null,"1/2 x 1/2",null,"71138 #58",null,"- Soft Grip, Extra Long 16\"",null,null,null,null,"Barwalt",null,"Stock",null,{"$f":"IF(Suggested=\"Yes\",'Price List'!AA25,'Price List'!AG25)","v":12.35},"EA",{"$f":"+Instructions!$B$3","v":"N"},null,{"$f":"+Instructions!$D$23","v":0},{"$f":"ROUND($AA25*(1-W25)+0.004999,2)","v":12.35},null,"YES",12.35,{"$f":"+W25","v":0},{"$f":"+X25","v":12.35},{"$f":"(AG25-AC25)/AG25","v":0},null,{"$f":"+A25","v":"PR"},{"$f":"SUM(AJ25:AL25)+AE25","v":12.35},null,null,{"$f":"ROUND(AC25/(1-VLOOKUP(AF25,Group,2,FALSE)),2)","v":12.35},{"$f":"IF(VLOOKUP(AF25,Group,3,FALSE)=\"YES\",VLOOKUP(ROUND(ROUND(AJ25,1)-AJ25,2),Round,2,FALSE)+VLOOKUP(AF25,Group,4,FALSE),0)","v":0},{"$f":"IF(VLOOKUP(AF25,Group,5,FALSE)=\"\",0,ROUND(AJ25-0.04999,1)-AJ25+AM25)","v":0},{"$f":"IF(VLOOKUP(AF25,Group,5,FALSE)=\"\",\"\",VLOOKUP(AF25,Group,5,FALSE))","v":""},null,"X"]
[]
[null,null,null,"Euro-Notched - Trowels",null,null,null,null,null,null,null,null,null,null,null,null,null,null,null,null,null,null,null,null,null,null,null,null,null,null,null,null,null,null,null,null,null,null,null,null,"X"]
["TR","Troxell - All Other",null,"TX14-EUSS",null,"Euro-Notch",null,"14-EUSS",null,"- Soft Grip, Stainless Steel",null,null,null,null,"Troxell",null,"Stock","New",{"$f":"IF(Suggested=\"Yes\",'Price List'!AA28,'Price List'!AG28)","v":13.15},"EA",{"$f":"+Instructions!$B$3","v":"N"},null,{"$f":"+Instructions!$D$23","v":0},{"$f":"ROUND($AA28*(1-W28)+0.004999,2)","v":13.15},null,"new",13.15,{"$f":"+W28","v":0},{"$f":"+X28","v":13.15},{"$f":"(AG28-AC28)/AG28","v":0},null,{"$f":"+A28","v":"TR"},{"$f":"SUM(AJ28:AL28)+AE28","v":13.15},null,null,{"$f":"ROUND(AC28/(1-VLOOKUP(AF28,Group,2,FALSE)),2)","v":13.15},{"$f":"IF(VLOOKUP(AF28,Group,3,FALSE)=\"YES\",VLOOKUP(ROUND(ROUND(AJ28,1)-AJ28,2),Round,2,FALSE)+VLOOKUP(AF28,Group,4,FALSE),0)","v":0},{"$f":"IF(VLOOKUP(AF28,Group,5,FALSE)=\"\",0,ROUND(AJ28-0.04999,1)-AJ28+AM28)","v":0},{"$f":"IF(VLOOKUP(AF28,Group,5,FALSE)=\"\",\"\",VLOOKUP(AF28,Group,5,FALSE))","v":""},null,"X"]
[null,null,null,null,null,null,null,null,null,null,null,null,null,null,null,null,null,null,null,null,null,null,null,null,null,null,null,null,null,null,null,null,null,null,null,null,null,null,null,null,"X"]
[null,null,null,"Schluter Sized - Trowels",null,null,null,null,null,null,null,null,null,null,null,null,null,null,null,null,null,null,null,null,null,null,null,null,null,null,null,null,null,null,null,null,null,null,null,null,"X"]
["SH","Schluter - Trowels",null,"SHTRLKER6",null,"1/8 x 1/8",null,"TRL-KER",null,"Schluter Kerdi trowel",null,null,null,null,"Schluter",null,"n/s",null,{"$f":"IF(Suggested=\"Yes\",'Price List'!AA31,'Price List'!AG31)","v":20.55},"EA",{"$f":"+Instructions!$B$3","v":"N"},null,{"$f":"+Instructions!$D$23","v":0},{"$f":"ROUND($AA31*(1-W31)+0.004999,2)","v":20.55},null,"YES",20.55,{"$f":"+W31","v":0},{"$f":"+X31","v":20.55},{"$f":"(AG31-AC31)/AG31","v":0},null,{"$f":"+A31","v":"SH"},{"$f":"SUM(AJ31:AL31)+AE31","v":20.55},null,null,{"$f":"ROUND(AC31/(1-VLOOKUP(AF31,Group,2,FALSE)),2)","v":20.55},{"$f":"IF(VLOOKUP(AF31,Group,3,FALSE)=\"YES\",VLOOKUP(ROUND(ROUND(AJ31,1)-AJ31,2),Round,2,FALSE)+VLOOKUP(AF31,Group,4,FALSE),0)","v":0},{"$f":"IF(VLOOKUP(AF31,Group,5,FALSE)=\"\",0,ROUND(AJ31-0.04999,1)-AJ31+AM31)","v":0},{"$f":"IF(VLOOKUP(AF31,Group,5,FALSE)=\"\",\"\",VLOOKUP(AF31,Group,5,FALSE))","v":""},null,"X"]
["TR","Troxell - All Other",null,"TX1410SS",null,"1/8 x 1/8",null,"14-10SS",null,"Kerdi-Size Trowel, Soft Grip, Stainless",null,null,null,null,"Troxell",null,"Stock",null,{"$f":"IF(Suggested=\"Yes\",'Price List'!AA32,'Price List'!AG32)","v":13.15},"EA",{"$f":"+Instructions!$B$3","v":"N"},null,{"$f":"+Instructions!$D$23","v":0},{"$f":"ROUND($AA32*(1-W32)+0.004999,2)","v":13.15},null,"YES",13.15,{"$f":"+W32","v":0},{"$f":"+X32","v":13.15},{"$f":"(AG32-AC32)/AG32","v":0},null,{"$f":"+A32","v":"TR"},{"$f":"SUM(AJ32:AL32)+AE32","v":13.15},null,null,{"$f":"ROUND(AC32/(1-VLOOKUP(AF32,Group,2,FALSE)),2)","v":13.15},{"$f":"IF(VLOOKUP(AF32,Group,3,FALSE)=\"YES\",VLOOKUP(ROUND(ROUND(AJ32,1)-AJ32,2),Round,2,FALSE)+VLOOKUP(AF32,Group,4,FALSE),0)","v":0},{"$f":"IF(VLOOKUP(AF32,Group,5,FALSE)=\"\",0,ROUND(AJ32-0.04999,1)-AJ32+AM32)","v":0},{"$f":"IF(VLOOKUP(AF32,Group,5,FALSE)=\"\",\"\",VLOOKUP(AF32,Group,5,FALSE))","v":""},null,"X"]
[]
["SH","Schluter - Trowels",null,"SHTRLDIT6",null,"11/64 x 11/64",null,"TRL-DIT",null,"Schluter Ditra trowel",null,null,null,null,"Schluter",null,"n/s",null,{"$f":"IF(Suggested=\"Yes\",'Price List'!AA34,'Price List'!AG34)","v":20.55},"EA",{"$f":"+Instructions!$B$3","v":"N"},null,{"$f":"+Instructions!$D$23","v":0},{"$f":"ROUND($AA34*(1-W34)+0.004999,2)","v":20.55},null,"YES",20.55,{"$f":"+W34","v":0},{"$f":"+X34","v":20.55},{"$f":"(AG34-AC34)/AG34","v":0},null,{"$f":"+A34","v":"SH"},{"$f":"SUM(AJ34:AL34)+AE34","v":20.55},null,null,{"$f":"ROUND(AC34/(1-VLOOKUP(AF34,Group,2,FALSE)),2)","v":20.55},{"$f":"IF(VLOOKUP(AF34,Group,3,FALSE)=\"YES\",VLOOKUP(ROUND(ROUND(AJ34,1)-AJ34,2),Round,2,FALSE)+VLOOKUP(AF34,Group,4,FALSE),0)","v":0},{"$f":"IF(VLOOKUP(AF34,Group,5,FALSE)=\"\",0,ROUND(AJ34-0.04999,1)-AJ34+AM34)","v":0},{"$f":"IF(VLOOKUP(AF34,Group,5,FALSE)=\"\",\"\",VLOOKUP(AF34,Group,5,FALSE))","v":""},null,"X"]
["TR","Troxell - All Other",null,"TX1420SS",null,"11/64 x 11/64",null,"14-20SS",null,"Ditra-Size Trowel, Soft Grip, Stainless",null,null,null,null,"Troxell",null,"Stock",null,{"$f":"IF(Suggested=\"Yes\",'Price List'!AA35,'Price List'!AG35)","v":13.15},"EA",{"$f":"+Instructions!$B$3","v":"N"},null,{"$f":"+Instructions!$D$23","v":0},{"$f":"ROUND($AA35*(1-W35)+0.004999,2)","v":13.15},null,"YES",13.15,{"$f":"+W35","v":0},{"$f":"+X35","v":13.15},{"$f":"(AG35-AC35)/AG35","v":0},null,{"$f":"+A35","v":"TR"},{"$f":"SUM(AJ35:AL35)+AE35","v":13.15},null,null,{"$f":"ROUND(AC35/(1-VLOOKUP(AF35,Group,2,FALSE)),2)","v":13.15},{"$f":"IF(VLOOKUP(AF35,Group,3,FALSE)=\"YES\",VLOOKUP(ROUND(ROUND(AJ35,1)-AJ35,2),Round,2,FALSE)+VLOOKUP(AF35,Group,4,FALSE),0)","v":0},{"$f":"IF(VLOOKUP(AF35,Group,5,FALSE)=\"\",0,ROUND(AJ35-0.04999,1)-AJ35+AM35)","v":0},{"$f":"IF(VLOOKUP(AF35,Group,5,FALSE)=\"\",\"\",VLOOKUP(AF35,Group,5,FALSE))","v":""},null,"X"]
[]
[null,null,null,"V-Notched - Trowels",null,null,null,null,null,null,null,null,null,null,null,null,null,null,null,null,null,null,null,null,null,null,null,null,null,null,null,null,null,null,null,null,null,null,null,null,"X"]
["TR","Troxell - All Other",null,"TX14-44SS",null,"3/16 x 1/4",null,"14-44SS",null,"- Soft Grip, Stainless Steel",null,null,null,null,"Troxell",null,"Stock","New",{"$f":"IF(Suggested=\"Yes\",'Price List'!AA38,'Price List'!AG38)","v":13.15},"EA",{"$f":"+Instructions!$B$3","v":"N"},null,{"$f":"+Instructions!$D$23","v":0},{"$f":"ROUND($AA38*(1-W38)+0.004999,2)","v":13.15},null,"new",13.15,{"$f":"+W38","v":0},{"$f":"+X38","v":13.15},{"$f":"(AG38-AC38)/AG38","v":0},null,{"$f":"+A38","v":"TR"},{"$f":"SUM(AJ38:AL38)+AE38","v":13.15},null,null,{"$f":"ROUND(AC38/(1-VLOOKUP(AF38,Group,2,FALSE)),2)","v":13.15},{"$f":"IF(VLOOKUP(AF38,Group,3,FALSE)=\"YES\",VLOOKUP(ROUND(ROUND(AJ38,1)-AJ38,2),Round,2,FALSE)+VLOOKUP(AF38,Group,4,FALSE),0)","v":0},{"$f":"IF(VLOOKUP(AF38,Group,5,FALSE)=\"\",0,ROUND(AJ38-0.04999,1)-AJ38+AM38)","v":0},{"$f":"IF(VLOOKUP(AF38,Group,5,FALSE)=\"\",\"\",VLOOKUP(AF38,Group,5,FALSE))","v":""},null,"X"]
[null,null,null,null,null,null,null,null,null,null,null,null,null,null,null,null,null,null,null,null,null,null,null,null,null,null,null,null,null,null,null,null,null,null,null,null,null,null,null,null,"X"]
["TR","Troxell - All Other",null,"TX14-33SS",null,"1/4 x 5/16",null,"14-33SS",null,"- Soft Grip, Stainless Steel",null,null,null,null,"Troxell",null,"Stock","New",{"$f":"IF(Suggested=\"Yes\",'Price List'!AA40,'Price List'!AG40)","v":13.15},"EA",{"$f":"+Instructions!$B$3","v":"N"},null,{"$f":"+Instructions!$D$23","v":0},{"$f":"ROUND($AA40*(1-W40)+0.004999,2)","v":13.15},null,"new",13.15,{"$f":"+W40","v":0},{"$f":"+X40","v":13.15},{"$f":"(AG40-AC40)/AG40","v":0},null,{"$f":"+A40","v":"TR"},{"$f":"SUM(AJ40:AL40)+AE40","v":13.15},null,null,{"$f":"ROUND(AC40/(1-VLOOKUP(AF40,Group,2,FALSE)),2)","v":13.15},{"$f":"IF(VLOOKUP(AF40,Group,3,FALSE)=\"YES\",VLOOKUP(ROUND(ROUND(AJ40,1)-AJ40,2),Round,2,FALSE)+VLOOKUP(AF40,Group,4,FALSE),0)","v":0},{"$f":"IF(VLOOKUP(AF40,Group,5,FALSE)=\"\",0,ROUND(AJ40-0.04999,1)-AJ40+AM40)","v":0},{"$f":"IF(VLOOKUP(AF40,Group,5,FALSE)=\"\",\"\",VLOOKUP(AF40,Group,5,FALSE))","v":""},null,"X"]
{"$rows_left_out":400}
{"sheet":"Websites","index":3,"n_rows":16,"n_cols":2,"rows_kept":16,"cut":false,"hidden":false,"merged":[]}
["Easy Access Website links"]
[]
["ConestogaTile's Website","www.conestogatile.com"]
[]
["Manufacturer's Home Page"]
["Barwalt","www.barwalt.com"]
["European Tile Masters (ETMM)","www.europeantilemasters"]
["IQ Saws","https://iqpowertools.com/"]
["Mark E. Ind.","www.markeindustries.com"]
["MK Diamond","www.mkdiamond.com"]
["Progress Profiles","www.progressprofiles.com"]
["Rubi Tools","www.rubi.com"]
["Sigma (RTC)","www.rtcproducts.com"]
["Troxell Tools","https://troxellusa.com/"]
[]
["Product","Direct Website Link"]

{"sheet":"Updates","index":4,"n_rows":16,"n_cols":3,"rows_kept":16,"cut":false,"hidden":false,"merged":[]}
[null,"Price List"]
["Mfg","Date","Description"]
[]
["New Products"]
[]
[]
[]
[]
[]
[]
[]
[]
[]
[]
[]
["Discontinued Products"]