{"text_format":"1","workbook":"xlsx","n_sheets":5,"sheets":["Instructions","Index","Price List","Websites","Changes"],"not_rendered":{"charts":0,"images":2,"macros":1,"external_links":1,"defined_names":19,"comments":0,"pivot_tables":0},"unopened":[],"bounds":{"document_bytes":16777216,"sheet_cells":100000,"rows_first":2000,"rows_last":500,"rows_between":2000,"halvings":0,"cell_chars":16384,"cell_head_chars":4096},"cells_cut":0,"cells_raw":0,"read":"whole","date_system":"1900"}

{"sheet":"Instructions","index":0,"n_rows":58,"n_cols":10,"rows_kept":58,"cut":false,"hidden":false,"merged":[[7,2,7,7],[36,3,36,4]]}
["Manufacturer","Schluter Ditra-Heat"]
["File as","S"]
["Product Code","N"]
["CCTD Effective Date","4/1/23"]
[]
[]
[]
["Enter your Company Name"]
[]
[null,"Click on \"Index\" to set the print area for the price list index"]
[null,"Then you can send it to print"]
[]
[]
[null,"Click on \"Suggested Price List\" to set the print area for Conestoga Tile's suggested price list."]
[null,"Then you can send it to print"]
[]
[]
[null,"Enter your discount codes if you want a personal net cost sheet."]
[]
[null,"Product"]
[null,"Code","Disc. %"]
[null,{"$f":"+B3","v":"N"},0,"  This is a \"NET\" price list.  0% is the discount for this spreadsheet"]
[]
[null,"Click on \"Your Cost\" to set the print area for your personal cost report."]
[null,"Then you can send it to print"]
[]
[]
["Discount: ","To help establish your price list, enter the gross profit percent for each type of product."]
[null,"If you want to use Conestoga Tile's list price, leave them blank."]
[]
["Round Nickel: ","If you always want your price to round to the nearest nickel, enter \"YES\"."]
[null,"If you enter \"NO\", it will NOT round to the nearest nickel."]
[]
["Ending Cents: ","If you always want your price to end with a certain cents, enter that cent value."]
[null,"If you leave it \"blank\" will NOT round to this cent value."]
[]
[null,"Group","GP Margin","GP Margin % for",null,"Round Nickel","add/subtract","Ending Cents",null,"  "]
[null,1,null,"Membrane- Roll",null,"No",0]
[null,2,null,"Membrane- Sheet",null,"No",0]
[null,3,null,"Cable & Kits",null,"No",0]
{"$rows_left_out":19}
{"sheet":"Index","index":1,"n_rows":51,"n_cols":11,"rows_kept":51,"cut":false,"hidden":false,"merged":[[5,0,5,10],[48,0,48,10],[50,0,50,10],[2,5,2,10],[3,4,3,7]]}
[]
[]
[null,null,null,null,null,{"$f":"\"File '\"&Instructions!B2&\"' - \"&Instructions!B1","v":"File 'S' - Schluter Ditra-Heat"}]
[]
[]
[{"$f":"\"Price List Index - \"&Instructions!B4","v":"Price List Index - 4/1/23"}]
[]
[]
[]
[]
["Page",null,"Series",null,"Product Type",null,"Page",null,"Series",null,"Product Type"]
[]
[]
[]
[]
[]
[]
[]
[]
[]
[]
[]
[]
[]
[]
[]
[]
[]
[]
[]
[]
[]
[]
[]
[]
[]
[]
[]
[]
[]
{"$rows_left_out":12}
{"sheet":"Price List","index":2,"n_rows":188,"n_cols":41,"rows_kept":188,"cut":false,"hidden":false,"merged":[[84,12,84,13],[93,12,93,13],[97,12,97,13],[99,12,99,13],[85,12,85,13],[86,12,86,13],[95,12,95,13],[96,12,96,13],[177,3,177,4],[18,2,18,19],[170,2,170,19],[106,12,106,13],[109,12,109,13],[111,12,111,13],[108,12,108,13],[20,2,20,19],[110,12,110,13],[77,12,77,13],[78,12,78,13],[80,12,80,13],[82,12,82,13],[104,12,104,13],[107,12,107,13],[79,12,79,13],[9,22,9,23],[12,13,12,19],[70,12,70,13],[73,12,73,13],[102,12,102,13],[75,12,75,13],[76,12,76,13],[72,12,72,13],[74,12,74,13],[14,13,15,19],[17,14,17,15],[81,12,81,13],[83,12,83,13],[9,25,9,32],[12,22,12,23],[172,2,172,19],[10,14,10,15],[9,14,9,19],[13,30,13,32],[112,12,112,13],[98,12,98,13],[100,12,100,13],[101,12,101,13],[103,12,103,13],[105,12,105,13]]}
[null,"Membrane- Roll",null,null,"Size",null,"Shape",null,null,null,null,null,null,null,null,null,null,null,{"$f":"IF(Suggested=\"Yes\",AA1,AG1)","v":0.05},"Roll",{"$f":"+Instructions!$B$3","v":"N"},null,{"$f":"+Instructions!$C$22","v":0},{"$f":"ROUND($AA1*(1-W1)+0.004999,2)","v":0.05},null,"new",0.05,{"$f":"+W1","v":0},0.05,{"$f":"(AG1-AC1)/AG1","v":0},null,1,{"$f":"SUM(AJ1:AL1)+AE1","v":0.05},null,null,{"$f":"ROUND(AC1/(1-VLOOKUP(AF1,Group,2,FALSE)),2)","v":0.05},{"$f":"IF(VLOOKUP(AF1,Group,5,FALSE)=\"YES\",VLOOKUP(ROUND(ROUND(AJ1,1)-AJ1,2),Round,2,FALSE)+VLOOKUP(AF1,Group,6,FALSE),0)","v":0},{"$f":"IF(VLOOKUP(AF1,Group,7,FALSE)=\"\",0,ROUND(AJ1-0.04999,1)-AJ1+AM1)","v":0},{"$f":"IF(VLOOKUP(AF1,Group,7,FALSE)=\"\",\"\",VLOOKUP(AF1,Group,7,FALSE))","v":""},null,"X"]
[null,"Membrane- Sheet",null,null,"Size",null,"Shape",null,null,null,null,null,null,null,null,null,null,null,{"$f":"IF(Suggested=\"Yes\",AA2,AG2)","v":0.05},"Sheet",{"$f":"+Instructions!$B$3","v":"N"},null,{"$f":"+Instructions!$C$22","v":0},0.05,null,"new",0.05,0,0.05,0,null,2,0.05,null,null,0.05,0,0,"",null,"X"]
[null,"Cable & Kits",null,null,"Size",null,"Shape",null,null,null,null,null,null,null,null,null,null,null,0.05,"EA",{"$f":"+Instructions!$B$3","v":"N"},null,{"$f":"+Instructions!$C$22","v":0},0.05,null,"new",0.05,0,0.05,0,null,3,0.05,null,null,0.05,0,0,"",null,"X"]
[null,"Thermostats",null,null,"Size",null,"Shape",null,null,null,null,null,null,null,null,null,null,null,0.05,"EA",{"$f":"+Instructions!$B$3","v":"N"},null,{"$f":"+Instructions!$C$22","v":0},0.05,null,"new",0.05,0,0.05,0,null,4,0.05,null,null,0.05,0,0,"",null,"X"]
[null,0,null,null,"Size",null,"Shape",null,null,null,null,null,null,null,null,null,null,null,0,"EA",{"$f":"+Instructions!$B$3","v":"N"},null,{"$f":"+Instructions!$C$22","v":0},0,null,"new",0,0,0,{"$error":"#DIV/0!"},null,5,0,null,null,0,0,0,"",null,"X"]
[null,0,null,null,"Size",null,"Shape",null,null,null,null,null,null,null,null,null,null,null,0,"EA",{"$f":"+Instructions!$B$3","v":"N"},null,{"$f":"+Instructions!$C$22","v":0},0,null,"new",0,0,0,{"$error":"#DIV/0!"},null,6,0,null,null,0,0,0,"",null,"X"]
[null,0,null,null,"Size",null,"Shape",null,null,null,null,null,null,null,null,null,null,null,0,"EA",{"$f":"+Instructions!$B$3","v":"N"},null,{"$f":"+Instructions!$C$22","v":0},0,null,"new",0,0,0,{"$error":"#DIV/0!"},null,7,0,null,null,0,0,0,"",null,"X"]
[null,"Format",null,null,null,null,null,null,null,null,null,null,null,null,null,null,"Stock","a",1000,"ABC",null,null,0.1,1000,null,"ABC",1000,0.1,1000,0.1,10,null,1000,null,null,null,null,null,null,null,"X"]
[null,null,null,null,null,null,null,null,null,null,null,null,null,null,null,null,null,null,null,null,null,null,null,null,null,null,null,null,null,null,null,null,null,null,null,null,null,null,null,null,"X"]
[null,null,null,null,null,null,null,null,null,null,null,null,null,null,"Price List",null,null,null,null,null,null,null,"Cust. Cost",null,null,"Customer Cost Calculation",null,null,null,null,null,null,null,null,null,null,null,null,null,null,"X"]
[null,null,null,"Sizes & Shapes",null,null,null,null,null,null,null,"Schluter Part #",null,null,"Full Carton",null,"Stock","Note",{"$f":"IF(Suggested=\"Yes\",AA11,AG11)","v":"Net Price"},"U/M","Code",null,"Disc.","Net",null,"Chg","Net Price","Disc","Act. Cost","GP%","Adj.","Group","Price",null,null,"Calc Price",".05 Round","Cents","Round to",null,"X"]
[null,null,null,null,null,null,null,null,null,null,null,null,null,null,null,null,null,null,null,null,null,null,null,null,null,null,null,null,null,null,null,null,null,null,null,null,null,null,null,null,"X"]
[null,null,null,null,null,null,null,null,null,null,null,null,null,{"$f":"\"File '\"&Instructions!B2&\"' - \"&Instructions!B1","v":"File 'S' - Schluter Ditra-Heat"},null,null,null,null,null,null,null,null,"Cost",null,null,null,null,null,null,null,null,null,"Retail Price Calculations",null,null,null,null,null,null,null,"X"]
[null,null,null,null,null,null,null,null,null,null,null,null,null,null,null,null,null,null,null,{"$f":"+Instructions!B4","v":"4/1/23"},null,null,null,null,null,null,null,null,null,null,{"$f":"TODAY()","v":"2023-03-01"},null,null,null,null,null,null,null,null,null,"X"]
[null,null,null,null,null,null,null,null,null,null,null,null,null,{"$f":"IF(Instructions!C8=\"\",\"\",+Instructions!C8)","v":""},null,null,null,null,null,null,null,null,null,null,null,null,null,null,null,null,null,null,null,null,null,null,null,null,null,null,"X"]
[null,null,{"$f":"\"Product Code '\"&Instructions!B3&\"'\"","v":"Product Code 'N'"},null,null,null,null,null,null,null,null,null,null,null,null,null,null,null,null,null,null,null,null,null,null,null,null,null,null,null,null,null,{"$f":"IF(Instructions!$C$8=\"\",\"\",Instructions!$C$8)","v":""},null,null,null,null,null,null,null,"X"]
[null,null,null,null,null,null,null,null,null,null,null,null,null,null,null,null,null,null,null,null,null,null,null,null,null,null,null,null,null,null,null,null,null,null,null,null,null,null,null,null,"X"]
[null,null,"Sizes & Shapes",null,null,null,"Schluter Part #",null,null,null,null,null,null,null,"Full Carton",null,"Stock","Note",{"$f":"+S$11","v":"Net Price"},"U/M",{"$f":"+U$11","v":"Code"},null,"Disc.","Net",null,"Chg","Net Price",{"$f":"+AB$11","v":"Disc"},"Act. Cost","GP%","Adj.",{"$f":"+AF$11","v":"Group"},"Price",null,null,"Calc Price",".05 Round","Cents","Round to",null,"X"]
[null,null,"ALL ITEMS MARKED WITH PACKAGING QUANTITY ARE SOLD IN MULTIPLES OF THAT QUANTITY ONLY",null,null,null,null,null,null,null,null,null,null,null,null,null,null,null,null,null,null,null,null,null,null,null,null,null,null,null,null,null,null,null,null,null,null,null,null,null,"X"]
[null,null,null,null,null,null,null,null,null,null,null,null,null,null,null,null,null,null,null,null,null,null,null,null,null,null,null,null,null,null,null,null,null,null,null,null,null,null,null,null,"X"]
[null,null,"PRICING LISTED IS NET PRICING. TRADE DISCOUNTS DO NOT APPLY.",null,null,null,null,null,null,null,null,null,null,null,null,null,null,null,null,null,null,null,null,null,null,null,null,null,null,null,null,null,null,null,null,null,null,null,null,null,"X"]
[]
[null,null,"DITRA-HEAT",null,null,null," ",null," ",null,null," "," "," ",null,null,null,"Item # Lookup:","SHDH5",null,null,null,null,null,null,null,null,null,null,null,null,null,null,null,null,null,null,null,null,null,"X"]
[null,null,null,null,null,null,null,null,null,null,null,null,null,null,null,null,null,null,null,null,null,null,null,null,null,null,null,null,null,null,null,null,null,null,null,null,null,null,null,null,"X"]
[null,null,null,null,"DITRA-HEAT is a polypropylene membrane with a cut-back stud structure & an anchoring fleece laminated to the underside.  The thickness of the mat,",null,null,null,null,null,null,null,null,null,null,null,null,null,null,null,null,null,null,null,null,null,null,null,null,null,null,null,null,null,null,null,null,null,null,null,"X"]
[null,null,null,null,"including the stud structure is 1/4\".  The stud structure is specifically designed to secure the DITRA-HEAT-E-HK electric floor heating cable in place.  In",null,null,null,null,null,null,null,null,null,null,null,null,null,null,null,null,null,null,null,null,null,null,null,null,null,null,null,null,null,null,null,null,null,null,null,"X"]
[null,null,null,null,"addition, DITRA-HEAT integrates customizable, comfortable electric floor warming with the functions associated with DITRA:  uncoupling, waterproofing,",null,null,null,null,null,null,null,null,null,null,null,null,null,null,null,null,null,null,null,null,null,null,null,null,null,null,null,null,null,null,null,null,null,null,null,"X"]
[null,null,null,null,"vapor management & support to ensure a long lasting installation.  ",null,null,null,null,null,null,null,null,null,null,null,null,null,null,null,null,null,null,null,null,null,null,null,null,null,null,null,null,null,null,null,null,null,null,null,"X"]
[null,null,null,null,null,null,null,null,null,null,null,null,null,null,null,null,null,null,null,null,null,null,null,null,null,null,null,null,null,null,null,null,null,null,null,null,null,null,null,null,"X"]
[null,"Membrane- Roll",null,null,"3' 2-5/8\" x 41' 10-3/4\"",null,"DH512M",null,null,null,null,null,null,null,null,"(134.50 SF/Roll)","Stock",null,{"$f":"IF(Suggested=\"Yes\",AA30,AG30)","v":265.14999999999998},"Roll",{"$f":"+Instructions!$B$3","v":"N"},null,{"$f":"+Instructions!$C$22","v":0},{"$f":"ROUND($AA30*(1-W30)+0.004999,2)","v":265.14999999999998},null,"YES",265.14999999999998,{"$f":"+W30","v":0},{"$f":"+X30","v":265.14999999999998},{"$f":"(AG30-AC30)/AG30","v":0},null,1,{"$f":"SUM(AJ30:AL30)+AE30","v":265.14999999999998},null,null,{"$f":"ROUND(AC30/(1-VLOOKUP(AF30,Group,2,FALSE)),2)","v":265.14999999999998},{"$f":"IF(VLOOKUP(AF30,Group,5,FALSE)=\"YES\",VLOOKUP(ROUND(ROUND(AJ30,1)-AJ30,2),Round,2,FALSE)+VLOOKUP(AF30,Group,6,FALSE),0)","v":0},{"$f":"IF(VLOOKUP(AF30,Group,7,FALSE)=\"\",0,ROUND(AJ30-0.04999,1)-AJ30+AM30)","v":0},{"$f":"IF(VLOOKUP(AF30,Group,7,FALSE)=\"\",\"\",VLOOKUP(AF30,Group,7,FALSE))","v":""},null,"X"]
[null,"Membrane- Sheet",null,null,"3' 2-5/8\" x 2' 7-3/8\"",null,"DH5MA",null,null,null,null,null,null,null,null,"(8.40 SF/Sheet)","Stock",null,{"$f":"IF(Suggested=\"Yes\",AA31,AG31)","v":17.25},"Sheet",{"$f":"+Instructions!$B$3","v":"N"},null,{"$f":"+Instructions!$C$22","v":0},{"$f":"ROUND($AA31*(1-W31)+0.004999,2)","v":17.25},null,"YES",17.25,{"$f":"+W31","v":0},{"$f":"+X31","v":17.25},{"$f":"(AG31-AC31)/AG31","v":0},null,2,{"$f":"SUM(AJ31:AL31)+AE31","v":17.25},null,null,{"$f":"ROUND(AC31/(1-VLOOKUP(AF31,Group,2,FALSE)),2)","v":17.25},{"$f":"IF(VLOOKUP(AF31,Group,5,FALSE)=\"YES\",VLOOKUP(ROUND(ROUND(AJ31,1)-AJ31,2),Round,2,FALSE)+VLOOKUP(AF31,Group,6,FALSE),0)","v":0},{"$f":"IF(VLOOKUP(AF31,Group,7,FALSE)=\"\",0,ROUND(AJ31-0.04999,1)-AJ31+AM31)","v":0},{"$f":"IF(VLOOKUP(AF31,Group,7,FALSE)=\"\",\"\",VLOOKUP(AF31,Group,7,FALSE))","v":""},null,"X"]
[]
[null,null,"DITRA-HEAT-PS",null,null,null," ",null," ",null,null," "," "," ",null,null,null,"Item # Lookup:","SHDHPS5",null,null,null,null,null,null,null,null,null,null,null,null,null,null,null,null,null,null,null,null,null,"X"]
[null,null,null,null,null,null,null,null,null,null,null,null,null,null,null,null,null,null,null,null,null,null,null,null,null,null,null,null,null,null,null,null,null,null,null,null,null,null,null,null,"X"]
[null,null,null,null,"DITRA-HEAT-PS is a peel and stick membrane that features a pressure-sensitive adhesive (PSA) to bond the membrane to the substrate, eliminating",null,null,null,null,null,null,null,null,null,null,null,null,null,null,null,null,null,null,null,null,null,null,null,null,null,null,null,null,null,null,null,null,null,null,null,"X"]
[null,null,null,null,"the need for thin-set mortar.  Quick and easy to install, DITRA-HEAT-PS integrates customizable, comfortable electric floor warming with the same",null,null,null,null,null,null,null,null,null,null,null,null,null,null,null,null,null,null,null,null,null,null,null,null,null,null,null,null,null,null,null,null,null,null,null,"X"]
[null,null,null,null,"functions associated with DITRA-HEAT: uncoupling, waterproofing, vapor management, and load support to ensure a long-lasting tile installation.",null,null,null,null,null,null,null,null,null,null,null,null,null,null,null,null,null,null,null,null,null,null,null,null,null,null,null,null,null,null,null,null,null,null,null,"X"]
[null,null,null,null,null,null,null,null,null,null,null,null,null,null,null,null,null,null,null,null,null,null,null,null,null,null,null,null,null,null,null,null,null,null,null,null,null,null,null,null,"X"]
[null,"Membrane- Roll",null,null,"3' 2-5/8\" x 41' 10-3/4\"",null,"DHPS512M",null,null,null,null,null,null,null,null,"(134.50 SF/Roll)","Stock",null,{"$f":"IF(Suggested=\"Yes\",AA39,AG39)","v":331.45},"Roll",{"$f":"+Instructions!$B$3","v":"N"},null,{"$f":"+Instructions!$C$22","v":0},{"$f":"ROUND($AA39*(1-W39)+0.004999,2)","v":331.45},null,"YES",331.45,{"$f":"+W39","v":0},{"$f":"+X39","v":331.45},{"$f":"(AG39-AC39)/AG39","v":0},null,1,{"$f":"SUM(AJ39:AL39)+AE39","v":331.45},null,null,{"$f":"ROUND(AC39/(1-VLOOKUP(AF39,Group,2,FALSE)),2)","v":331.45},{"$f":"IF(VLOOKUP(AF39,Group,5,FALSE)=\"YES\",VLOOKUP(ROUND(ROUND(AJ39,1)-AJ39,2),Round,2,FALSE)+VLOOKUP(AF39,Group,6,FALSE),0)","v":0},{"$f":"IF(VLOOKUP(AF39,Group,7,FALSE)=\"\",0,ROUND(AJ39-0.04999,1)-AJ39+AM39)","v":0},{"$f":"IF(VLOOKUP(AF39,Group,7,FALSE)=\"\",\"\",VLOOKUP(AF39,Group,7,FALSE))","v":""},null,"X"]
[null,"Membrane- Sheet",null,null,"3' 2-5/8\" x 2' 7-3/8\"",null,"DHPS5MA",null,null,null,null,null,null,null,null,"(8.40 SF/Sheet)","Stock",null,{"$f":"IF(Suggested=\"Yes\",AA40,AG40)","v":21.55},"Sheet",{"$f":"+Instructions!$B$3","v":"N"},null,{"$f":"+Instructions!$C$22","v":0},{"$f":"ROUND($AA40*(1-W40)+0.004999,2)","v":21.55},null,"YES",21.55,{"$f":"+W40","v":0},{"$f":"+X40","v":21.55},{"$f":"(AG40-AC40)/AG40","v":0},null,2,{"$f":"SUM(AJ40:AL40)+AE40","v":21.55},null,null,{"$f":"ROUND(AC40/(1-VLOOKUP(AF40,Group,2,FALSE)),2)","v":21.55},{"$f":"IF(VLOOKUP(AF40,Group,5,FALSE)=\"YES\",VLOOKUP(ROUND(ROUND(AJ40,1)-AJ40,2),Round,2,FALSE)+VLOOKUP(AF40,Group,6,FALSE),0)","v":0},{"$f":"IF(VLOOKUP(AF40,Group,7,FALSE)=\"\",0,ROUND(AJ40-0.04999,1)-AJ40+AM40)","v":0},{"$f":"IF(VLOOKUP(AF40,Group,7,FALSE)=\"\",\"\",VLOOKUP(AF40,Group,7,FALSE))","v":""},null,"X"]
{"$rows_left_out":149}
{"sheet":"Websites","index":3,"n_rows":14,"n_cols":6,"rows_kept":14,"cut":false,"hidden":false,"merged":[]}
["Easy Access Website links"]
[]
["ConestogaTile's Website","http://www.cctd.com/index.php"]
[]
["Manufacturer's Home Page","http://www.schluter.com/"]
[]
[]
["Product","Direct Website Link"]
["DITRA-HEAT","http://www.schluter.com/ditra-heat/index.html"]
[]
[]
[]
[]
[null,null,null,null,null," "]

{"sheet":"Changes","index":4,"n_rows":36,"n_cols":3,"rows_kept":36,"cut":false,"hidden":false,"merged":[]}
["Date"]
["Announced","Series","Description"]
[]
["New Products"]
["2014-03-04","DITRA-HEAT","Electric Floor Warming System"]
["2014-03-04","DITRA-HEAT-E-HK","Electric Floor Warming System"]
["2014-03-04","DITRA-HEAT-E-KIT","Electric Floor Warming System"]
["2014-03-04","DITRA-HEAT-E-RS","Electric Floor Warming System"]
["2015-09-08","DITRA-HEAT-E-HK","AEMC Megohmmeter Model 6527 added."]
["2016-04-07","DITRA-HEAT-TB","Electric floor warming system with an integrated thermal break."]
["2016-04-07","DITRA-HEAT-E-R","DHERT102/BW Programmable Touchscreen Thermostat, DHERT103/BW Non-Programmable Thermostat & DHERR1/BW Power Module added. "]
["2016-06-21","DITRA-HEAT-E-KIT","2 Kits added that include the new Touchscreen Programmable Thermostat."]
["2018-05-07","DITRA-HEAT-E-WiFi","Programmable WiFi Thermostat added. "]
["2018-05-14","DITRA-HEAT-E-KIT","DHEKRTW12040 and DHEKRTW12056 120 V Kits.  An all-inclusive package containing the DITRA-HEAT uncoupling membrane, DITRA-HEAT-E-HK heating cable and the DHERT104/BW Programmable WiFi Touchscreen Thermostat."]
["2022-10-20","DITRA-HEAT-PS","DITRA-HEAT-PS is a peel and stick membrane that features a pressure-sensitive adhesive (PSA) to bond the membrane to the substrate, eliminating the need for thin-set mortar.  Quick and easy to install, DITRA-HEAT-PS integrates customizable, comfortable electric floor warming with the same functions associated with DITRA-HEAT: uncoupling, waterproofing, vapor management, and load support to ensure a long-lasting tile installation."]
["2022-10-20","DITRA-HEAT-DUO-PS","DITRA-HEAT-DUO-PS is a peel and stick membrane that features a pressure-sensitive adhesive (PSA) to bond the membrane to the substrate, eliminating the need for thin-set mortar.  Quick and easy to install, DITRA-HEAT-DUO-PS is an uncoupling membrane with an integrated bonding fleece that provides sound control, as well as a thermal break.  Optionally, the system can be customized with of DITRA-HEAT-HK floor heating cables to create a warm tiled floor."]
["2023-01-17","DITRA-HEAT-E-RS1","DHERT105/BW Smart Thermostat with Wi-Fi, App, & Voice Control added."]
["2023-01-17","DITRA-HEAT-E-RRS","DHERR2/BW Power Module to be used with the DHERT105/BW Smart Thermostat only added."]
[]
[null," "," "]
[]
["Discontinued Products"]
["2016-05-09","DITRA-HEAT-E-R","DHERS/BW Non-Programmable Thermostat."]
["2017-03-20","DITRA-HEAT-E-HK","DHEHK240269 888.0' 240 V Heating Cable only."]
["2017-05-01","DITRA-HEAT-TB","DHTB810M 5/16\" x 3' 3\" x 33' 108.00 SF Roll and the DHTB8MA 5/16\" x 3' 3\" x 2' 7\" 8.60 SF Sheet.  (Being replaced by the DITRA-HEAT-DUO uncoupling and waterproofing membrane with integrated sound control and thermal break.)"]
["2018-05-14","DITRA-HEAT-E","DHERSD/BW Programmable Thermostat."]
["2018-05-14","DITRA-HEAT-E-KIT","DHEK12040 and DHEK12056 120 V Kits that contain the DHERSD/BW Programmable Thermostat."]
["2022-05-19","DITRA-HEAT-E-KIT","DHEKRTW12040 and DHEKRTW12056 120 V Kits that contain the DHERT104/BW Programmable WiFi Touchscreen Thermostat.  DHEKRT12040 and DHEKRT12056 120 V Kits that contain the DHERT102/BW Programmable Touchscreen Thermostat."]
[]
[]
[]
["Changes"]
["2016-06-15","DITRA-HEAT-E","The DHERSD/BW Programmable Thermostat is an item Schluter is currently offering and is NOT discontinued as was previously reported on the May 9, 2016 Supplier/Product Update.  Conestoga will continue to \"Stock\" this thermostat."]
["2017-05-03","DITRA-HEAT-TB","DITRA-HEAT-TB has been renamed DITRA-HEAT-DUO.  Item # DHTB810M 5/16\" x 3' 3\" x 33' 108.00 SF Roll is now # DHD810M.  Item # DHTB8MA 5/16\" x 3' 3\" x 2' 7\" 8.60 SF Sheet is now # DHD8MA."]
["n/a",null,"(1/29/19 - Removing the AEMC Megohmmeter Model 6527 from price list.)"]
["2020-10-05"," DITRA-HEAT & DITRA-HEAT-DUO","These membranes will soon have a new design featuring cutting grooves.  This design enhancement provides an easy-cut guide and greater membrane flexibility.  Other design improvements are that membranes will be rolled fleece side out making it easier to roll into thin-set and the edges will be modified to hold a cable along the length of a seam."]